(view as text)
gmake check-recursive
gmake[1]: Entering directory '/export/home/buildbot/slave/gawk-solaris10-i386/build'
Making check in support
gmake[2]: Entering directory '/export/home/buildbot/slave/gawk-solaris10-i386/build/support'
gmake[2]: Nothing to be done for 'check'.
gmake[2]: Leaving directory '/export/home/buildbot/slave/gawk-solaris10-i386/build/support'
Making check in .
gmake[2]: Entering directory '/export/home/buildbot/slave/gawk-solaris10-i386/build'
gmake check-local
gmake[3]: Entering directory '/export/home/buildbot/slave/gawk-solaris10-i386/build'
gmake[3]: Nothing to be done for 'check-local'.
gmake[3]: Leaving directory '/export/home/buildbot/slave/gawk-solaris10-i386/build'
gmake[2]: Leaving directory '/export/home/buildbot/slave/gawk-solaris10-i386/build'
Making check in extension
gmake[2]: Entering directory '/export/home/buildbot/slave/gawk-solaris10-i386/build/extension'
Making check in po
gmake[3]: Entering directory '/export/home/buildbot/slave/gawk-solaris10-i386/build/extension/po'
gmake[3]: Nothing to be done for 'check'.
gmake[3]: Leaving directory '/export/home/buildbot/slave/gawk-solaris10-i386/build/extension/po'
gmake[3]: Entering directory '/export/home/buildbot/slave/gawk-solaris10-i386/build/extension'
gmake[3]: Leaving directory '/export/home/buildbot/slave/gawk-solaris10-i386/build/extension'
gmake[2]: Leaving directory '/export/home/buildbot/slave/gawk-solaris10-i386/build/extension'
Making check in extras
gmake[2]: Entering directory '/export/home/buildbot/slave/gawk-solaris10-i386/build/extras'
gmake[2]: Nothing to be done for 'check'.
gmake[2]: Leaving directory '/export/home/buildbot/slave/gawk-solaris10-i386/build/extras'
Making check in doc
gmake[2]: Entering directory '/export/home/buildbot/slave/gawk-solaris10-i386/build/doc'
gmake[2]: Nothing to be done for 'check'.
gmake[2]: Leaving directory '/export/home/buildbot/slave/gawk-solaris10-i386/build/doc'
Making check in awklib
gmake[2]: Entering directory '/export/home/buildbot/slave/gawk-solaris10-i386/build/awklib'
gmake[2]: Nothing to be done for 'check'.
gmake[2]: Leaving directory '/export/home/buildbot/slave/gawk-solaris10-i386/build/awklib'
Making check in po
gmake[2]: Entering directory '/export/home/buildbot/slave/gawk-solaris10-i386/build/po'
gmake[2]: Nothing to be done for 'check'.
gmake[2]: Leaving directory '/export/home/buildbot/slave/gawk-solaris10-i386/build/po'
Making check in test
gmake[2]: Entering directory '/export/home/buildbot/slave/gawk-solaris10-i386/build/test'
Any output from "cmp" is bad news, although some differences
in floating point values are probably benign -- in particular,
some systems may omit a leading zero and the floating point
precision may lead to slightly different output in a few cases.
Locale environment:
LC_ALL="C" LANG="C"
======== Starting basic tests ========
addcomma
./checkmany.sh: -s}: not found
./checkmany.sh: _addcomma: not found
./checkmany.sh: _addcomma: not found
gmake[2]: [Makefile:3281: addcomma] Error 1 (ignored)
anchgsub
./checkmany.sh: -s}: not found
./checkmany.sh: _anchgsub: not found
./checkmany.sh: _anchgsub: not found
gmake[2]: [Makefile:3286: anchgsub] Error 1 (ignored)
anchor
./checkmany.sh: -s}: not found
./checkmany.sh: _anchor: not found
./checkmany.sh: _anchor: not found
gmake[2]: [Makefile:3291: anchor] Error 1 (ignored)
argarray
./checkmany.sh: -s}: not found
./checkmany.sh: _argarray: not found
./checkmany.sh: _argarray: not found
gmake[2]: [Makefile:2568: argarray] Error 1 (ignored)
argcasfile
./checkmany.sh: -s}: not found
./checkmany.sh: _argcasfile: not found
./checkmany.sh: _argcasfile: not found
gmake[2]: [Makefile:3252: argcasfile] Error 1 (ignored)
arrayind1
./checkmany.sh: -s}: not found
./checkmany.sh: _arrayind1: not found
./checkmany.sh: _arrayind1: not found
gmake[2]: [Makefile:3296: arrayind1] Error 1 (ignored)
arrayind2
./checkmany.sh: -s}: not found
./checkmany.sh: _arrayind2: not found
./checkmany.sh: _arrayind2: not found
gmake[2]: [Makefile:3301: arrayind2] Error 1 (ignored)
arrayind3
./checkmany.sh: -s}: not found
./checkmany.sh: _arrayind3: not found
./checkmany.sh: _arrayind3: not found
gmake[2]: [Makefile:3306: arrayind3] Error 1 (ignored)
arrayparm
./checkmany.sh: -s}: not found
./checkmany.sh: _arrayparm: not found
./checkmany.sh: _arrayparm: not found
gmake[2]: [Makefile:3311: arrayparm] Error 1 (ignored)
arrayprm2
./checkmany.sh: -s}: not found
./checkmany.sh: _arrayprm2: not found
./checkmany.sh: _arrayprm2: not found
gmake[2]: [Makefile:3316: arrayprm2] Error 1 (ignored)
arrayprm3
./checkmany.sh: -s}: not found
./checkmany.sh: _arrayprm3: not found
./checkmany.sh: _arrayprm3: not found
gmake[2]: [Makefile:3321: arrayprm3] Error 1 (ignored)
arrayref
./checkmany.sh: -s}: not found
./checkmany.sh: _arrayref: not found
./checkmany.sh: _arrayref: not found
gmake[2]: [Makefile:3326: arrayref] Error 1 (ignored)
arrymem1
./checkmany.sh: -s}: not found
./checkmany.sh: _arrymem1: not found
./checkmany.sh: _arrymem1: not found
gmake[2]: [Makefile:3331: arrymem1] Error 1 (ignored)
arryref2
./checkmany.sh: -s}: not found
./checkmany.sh: _arryref2: not found
./checkmany.sh: _arryref2: not found
gmake[2]: [Makefile:3336: arryref2] Error 1 (ignored)
arryref3
./checkmany.sh: -s}: not found
./checkmany.sh: _arryref3: not found
./checkmany.sh: _arryref3: not found
gmake[2]: [Makefile:3341: arryref3] Error 1 (ignored)
arryref4
./checkmany.sh: -s}: not found
./checkmany.sh: _arryref4: not found
./checkmany.sh: _arryref4: not found
gmake[2]: [Makefile:3346: arryref4] Error 1 (ignored)
arryref5
./checkmany.sh: -s}: not found
./checkmany.sh: _arryref5: not found
./checkmany.sh: _arryref5: not found
gmake[2]: [Makefile:3351: arryref5] Error 1 (ignored)
arynasty
./checkmany.sh: -s}: not found
./checkmany.sh: _arynasty: not found
./checkmany.sh: _arynasty: not found
gmake[2]: [Makefile:3356: arynasty] Error 1 (ignored)
arynocls
./checkmany.sh: -s}: not found
./checkmany.sh: _arynocls: not found
./checkmany.sh: _arynocls: not found
gmake[2]: [Makefile:2700: arynocls] Error 1 (ignored)
aryprm1
./checkmany.sh: -s}: not found
./checkmany.sh: _aryprm1: not found
./checkmany.sh: _aryprm1: not found
gmake[2]: [Makefile:3361: aryprm1] Error 1 (ignored)
aryprm2
./checkmany.sh: -s}: not found
./checkmany.sh: _aryprm2: not found
./checkmany.sh: _aryprm2: not found
gmake[2]: [Makefile:3366: aryprm2] Error 1 (ignored)
aryprm3
./checkmany.sh: -s}: not found
./checkmany.sh: _aryprm3: not found
./checkmany.sh: _aryprm3: not found
gmake[2]: [Makefile:3371: aryprm3] Error 1 (ignored)
aryprm4
./checkmany.sh: -s}: not found
./checkmany.sh: _aryprm4: not found
./checkmany.sh: _aryprm4: not found
gmake[2]: [Makefile:3376: aryprm4] Error 1 (ignored)
aryprm5
./checkmany.sh: -s}: not found
./checkmany.sh: _aryprm5: not found
./checkmany.sh: _aryprm5: not found
gmake[2]: [Makefile:3381: aryprm5] Error 1 (ignored)
aryprm6
./checkmany.sh: -s}: not found
./checkmany.sh: _aryprm6: not found
./checkmany.sh: _aryprm6: not found
gmake[2]: [Makefile:3386: aryprm6] Error 1 (ignored)
aryprm7
./checkmany.sh: -s}: not found
./checkmany.sh: _aryprm7: not found
./checkmany.sh: _aryprm7: not found
gmake[2]: [Makefile:3391: aryprm7] Error 1 (ignored)
aryprm8
./checkmany.sh: -s}: not found
./checkmany.sh: _aryprm8: not found
./checkmany.sh: _aryprm8: not found
gmake[2]: [Makefile:3396: aryprm8] Error 1 (ignored)
aryprm9
./checkmany.sh: -s}: not found
./checkmany.sh: _aryprm9: not found
./checkmany.sh: _aryprm9: not found
gmake[2]: [Makefile:3401: aryprm9] Error 1 (ignored)
arysubnm
./checkmany.sh: -s}: not found
./checkmany.sh: _arysubnm: not found
./checkmany.sh: _arysubnm: not found
gmake[2]: [Makefile:3406: arysubnm] Error 1 (ignored)
aryunasgn
./checkmany.sh: -s}: not found
./checkmany.sh: _aryunasgn: not found
./checkmany.sh: _aryunasgn: not found
gmake[2]: [Makefile:3411: aryunasgn] Error 1 (ignored)
asgext
./checkmany.sh: -s}: not found
./checkmany.sh: _asgext: not found
./checkmany.sh: _asgext: not found
gmake[2]: [Makefile:3416: asgext] Error 1 (ignored)
assignnumfield
./checkmany.sh: -s}: not found
./checkmany.sh: _assignnumfield: not found
./checkmany.sh: _assignnumfield: not found
gmake[2]: [Makefile:3421: assignnumfield] Error 1 (ignored)
assignnumfield2
./checkmany.sh: -s}: not found
./checkmany.sh: _assignnumfield2: not found
./checkmany.sh: _assignnumfield2: not found
gmake[2]: [Makefile:3426: assignnumfield2] Error 1 (ignored)
assignnumfield3
./checkmany.sh: -s}: not found
./checkmany.sh: _assignnumfield3: not found
./checkmany.sh: _assignnumfield3: not found
gmake[2]: [Makefile:3431: assignnumfield3] Error 1 (ignored)
awkpath
./checkmany.sh: -s}: not found
./checkmany.sh: _awkpath: not found
./checkmany.sh: _awkpath: not found
gmake[2]: [Makefile:2611: awkpath] Error 1 (ignored)
back89
./checkmany.sh: -s}: not found
./checkmany.sh: _back89: not found
./checkmany.sh: _back89: not found
gmake[2]: [Makefile:3436: back89] Error 1 (ignored)
backgsub
./checkmany.sh: -s}: not found
./checkmany.sh: _backgsub: not found
./checkmany.sh: _backgsub: not found
gmake[2]: [Makefile:3441: backgsub] Error 1 (ignored)
badassign1
./checkmany.sh: -s}: not found
./checkmany.sh: _badassign1: not found
./checkmany.sh: _badassign1: not found
gmake[2]: [Makefile:3446: badassign1] Error 1 (ignored)
badbuild
./checkmany.sh: -s}: not found
./checkmany.sh: _badbuild: not found
./checkmany.sh: _badbuild: not found
gmake[2]: [Makefile:3451: badbuild] Error 1 (ignored)
callparam
./checkmany.sh: -s}: not found
./checkmany.sh: _callparam: not found
./checkmany.sh: _callparam: not found
gmake[2]: [Makefile:3456: callparam] Error 1 (ignored)
case-check
./checkmany.sh: -s}: not found
./checkmany.sh: _case-check: not found
./checkmany.sh: _case-check: not found
./checkmany.sh: _case-check: not found
./checkmany.sh: _case-check: not found
./checkmany.sh: _case-check: not found
./checkmany.sh: _case-check: not found
./checkmany.sh: _case-check: not found
./checkmany.sh: _case-check: not found
gmake[2]: [Makefile:3461: case-check] Error 1 (ignored)
childin
./checkmany.sh: -s}: not found
./checkmany.sh: _childin: not found
./checkmany.sh: _childin: not found
gmake[2]: [Makefile:3467: childin] Error 1 (ignored)
clobber
close_status
./checkmany.sh: -s}: not found
./checkmany.sh: _close_status: not found
./checkmany.sh: _close_status: not found
gmake[2]: [Makefile:3472: close_status] Error 1 (ignored)
closebad
./checkmany.sh: -s}: not found
./checkmany.sh: _closebad: not found
./checkmany.sh: _closebad: not found
gmake[2]: [Makefile:3477: closebad] Error 1 (ignored)
clsflnam
./checkmany.sh: -s}: not found
./checkmany.sh: _clsflnam: not found
./checkmany.sh: _clsflnam: not found
gmake[2]: [Makefile:3482: clsflnam] Error 1 (ignored)
cmdlinefsbacknl
./checkmany.sh: -s}: not found
./checkmany.sh: _cmdlinefsbacknl: not found
./checkmany.sh: _cmdlinefsbacknl: not found
gmake[2]: [Makefile:3487: cmdlinefsbacknl] Error 1 (ignored)
cmdlinefsbacknl2
./checkmany.sh: -s}: not found
./checkmany.sh: _cmdlinefsbacknl2: not found
./checkmany.sh: _cmdlinefsbacknl2: not found
./checkmany.sh: _cmdlinefsbacknl2: not found
./checkmany.sh: _cmdlinefsbacknl2: not found
gmake[2]: [Makefile:3492: cmdlinefsbacknl2] Error 1 (ignored)
compare
./checkmany.sh: -s}: not found
./checkmany.sh: _compare: not found
./checkmany.sh: _compare: not found
gmake[2]: [Makefile:2590: compare] Error 1 (ignored)
compare2
./checkmany.sh: -s}: not found
./checkmany.sh: _compare2: not found
./checkmany.sh: _compare2: not found
gmake[2]: [Makefile:3497: compare2] Error 1 (ignored)
concat1
./checkmany.sh: -s}: not found
./checkmany.sh: _concat1: not found
./checkmany.sh: _concat1: not found
gmake[2]: [Makefile:3502: concat1] Error 1 (ignored)
concat2
./checkmany.sh: -s}: not found
./checkmany.sh: _concat2: not found
./checkmany.sh: _concat2: not found
gmake[2]: [Makefile:3507: concat2] Error 1 (ignored)
concat3
./checkmany.sh: -s}: not found
./checkmany.sh: _concat3: not found
./checkmany.sh: _concat3: not found
gmake[2]: [Makefile:3512: concat3] Error 1 (ignored)
concat4
./checkmany.sh: -s}: not found
./checkmany.sh: _concat4: not found
./checkmany.sh: _concat4: not found
./checkmany.sh: _concat4: not found
./checkmany.sh: _concat4: not found
gmake[2]: [Makefile:3517: concat4] Error 1 (ignored)
concat5
./checkmany.sh: -s}: not found
./checkmany.sh: _concat5: not found
./checkmany.sh: _concat5: not found
gmake[2]: [Makefile:3523: concat5] Error 1 (ignored)
convfmt
./checkmany.sh: -s}: not found
./checkmany.sh: _convfmt: not found
./checkmany.sh: _convfmt: not found
gmake[2]: [Makefile:3528: convfmt] Error 1 (ignored)
datanonl
./checkmany.sh: -s}: not found
./checkmany.sh: _datanonl: not found
./checkmany.sh: _datanonl: not found
gmake[2]: [Makefile:3533: datanonl] Error 1 (ignored)
defref
./checkmany.sh: -s}: not found
./checkmany.sh: _defref: not found
./checkmany.sh: _defref: not found
gmake[2]: [Makefile:3538: defref] Error 1 (ignored)
delargv
./checkmany.sh: -s}: not found
./checkmany.sh: _delargv: not found
./checkmany.sh: _delargv: not found
gmake[2]: [Makefile:3543: delargv] Error 1 (ignored)
delarpm2
./checkmany.sh: -s}: not found
./checkmany.sh: _delarpm2: not found
./checkmany.sh: _delarpm2: not found
gmake[2]: [Makefile:3548: delarpm2] Error 1 (ignored)
delarprm
./checkmany.sh: -s}: not found
./checkmany.sh: _delarprm: not found
./checkmany.sh: _delarprm: not found
gmake[2]: [Makefile:3553: delarprm] Error 1 (ignored)
delfunc
./checkmany.sh: -s}: not found
./checkmany.sh: _delfunc: not found
./checkmany.sh: _delfunc: not found
gmake[2]: [Makefile:3558: delfunc] Error 1 (ignored)
dfacheck2
./checkmany.sh: -s}: not found
./checkmany.sh: _dfacheck2: not found
./checkmany.sh: _dfacheck2: not found
gmake[2]: [Makefile:3563: dfacheck2] Error 1 (ignored)
dfamb1
./checkmany.sh: -s}: not found
./checkmany.sh: _dfamb1: not found
./checkmany.sh: _dfamb1: not found
./checkmany.sh: _dfamb1: not found
./checkmany.sh: _dfamb1: not found
gmake[2]: [Makefile:3568: dfamb1] Error 1 (ignored)
dfastress
./checkmany.sh: -s}: not found
./checkmany.sh: _dfastress: not found
./checkmany.sh: _dfastress: not found
gmake[2]: [Makefile:3574: dfastress] Error 1 (ignored)
divzero
./checkmany.sh: -s}: not found
./checkmany.sh: _divzero: not found
./checkmany.sh: _divzero: not found
gmake[2]: [Makefile:3579: divzero] Error 1 (ignored)
divzero2
./checkmany.sh: -s}: not found
./checkmany.sh: _divzero2: not found
./checkmany.sh: _divzero2: not found
gmake[2]: [Makefile:3584: divzero2] Error 1 (ignored)
dynlj
./checkmany.sh: -s}: not found
./checkmany.sh: _dynlj: not found
./checkmany.sh: _dynlj: not found
gmake[2]: [Makefile:3589: dynlj] Error 1 (ignored)
elemnew5
./checkmany.sh: -s}: not found
./checkmany.sh: _elemnew5: not found
./checkmany.sh: _elemnew5: not found
gmake[2]: [Makefile:3594: elemnew5] Error 1 (ignored)
elemnew6
./checkmany.sh: -s}: not found
./checkmany.sh: _elemnew6: not found
./checkmany.sh: _elemnew6: not found
gmake[2]: [Makefile:3599: elemnew6] Error 1 (ignored)
eofsplit
./checkmany.sh: -s}: not found
./checkmany.sh: _eofsplit: not found
./checkmany.sh: _eofsplit: not found
gmake[2]: [Makefile:3604: eofsplit] Error 1 (ignored)
eofsrc1
./checkmany.sh: -s}: not found
./checkmany.sh: _eofsrc1: not found
./checkmany.sh: _eofsrc1: not found
gmake[2]: [Makefile:3209: eofsrc1] Error 1 (ignored)
escapebrace
./checkmany.sh: -s}: not found
./checkmany.sh: _escapebrace: not found
./checkmany.sh: _escapebrace: not found
gmake[2]: [Makefile:3609: escapebrace] Error 1 (ignored)
exit2
./checkmany.sh: -s}: not found
./checkmany.sh: _exit2: not found
./checkmany.sh: _exit2: not found
gmake[2]: [Makefile:3614: exit2] Error 1 (ignored)
exitval1
./checkmany.sh: -s}: not found
./checkmany.sh: _exitval1: not found
./checkmany.sh: _exitval1: not found
gmake[2]: [Makefile:2753: exitval1] Error 1 (ignored)
exitval2
./checkmany.sh: -s}: not found
./checkmany.sh: _exitval2: not found
./checkmany.sh: _exitval2: not found
gmake[2]: [Makefile:3619: exitval2] Error 1 (ignored)
exitval3
./checkmany.sh: -s}: not found
./checkmany.sh: _exitval3: not found
./checkmany.sh: _exitval3: not found
gmake[2]: [Makefile:3624: exitval3] Error 1 (ignored)
fcall_exit
./checkmany.sh: -s}: not found
./checkmany.sh: _fcall_exit: not found
./checkmany.sh: _fcall_exit: not found
gmake[2]: [Makefile:3629: fcall_exit] Error 1 (ignored)
fcall_exit2
./checkmany.sh: -s}: not found
./checkmany.sh: _fcall_exit2: not found
./checkmany.sh: _fcall_exit2: not found
gmake[2]: [Makefile:3634: fcall_exit2] Error 1 (ignored)
fieldassign
./checkmany.sh: -s}: not found
./checkmany.sh: _fieldassign: not found
./checkmany.sh: _fieldassign: not found
gmake[2]: [Makefile:3639: fieldassign] Error 1 (ignored)
fieldindex
./checkmany.sh: -s}: not found
./checkmany.sh: _fieldindex: not found
./checkmany.sh: _fieldindex: not found
gmake[2]: [Makefile:3644: fieldindex] Error 1 (ignored)
fldchg
./checkmany.sh: -s}: not found
./checkmany.sh: _fldchg: not found
./checkmany.sh: _fldchg: not found
gmake[2]: [Makefile:3649: fldchg] Error 1 (ignored)
fldchgnf
./checkmany.sh: -s}: not found
./checkmany.sh: _fldchgnf: not found
./checkmany.sh: _fldchgnf: not found
gmake[2]: [Makefile:3654: fldchgnf] Error 1 (ignored)
fldterm
./checkmany.sh: -s}: not found
./checkmany.sh: _fldterm: not found
./checkmany.sh: _fldterm: not found
gmake[2]: [Makefile:3659: fldterm] Error 1 (ignored)
fmtmix
./checkmany.sh: -s}: not found
./checkmany.sh: _fmtmix: not found
./checkmany.sh: _fmtmix: not found
gmake[2]: [Makefile:3664: fmtmix] Error 1 (ignored)
fnamedat
./checkmany.sh: -s}: not found
./checkmany.sh: _fnamedat: not found
./checkmany.sh: _fnamedat: not found
gmake[2]: [Makefile:3669: fnamedat] Error 1 (ignored)
fnarray
./checkmany.sh: -s}: not found
./checkmany.sh: _fnarray: not found
./checkmany.sh: _fnarray: not found
gmake[2]: [Makefile:3674: fnarray] Error 1 (ignored)
fnarray2
./checkmany.sh: -s}: not found
./checkmany.sh: _fnarray2: not found
./checkmany.sh: _fnarray2: not found
gmake[2]: [Makefile:3679: fnarray2] Error 1 (ignored)
fnaryscl
./checkmany.sh: -s}: not found
./checkmany.sh: _fnaryscl: not found
./checkmany.sh: _fnaryscl: not found
gmake[2]: [Makefile:3684: fnaryscl] Error 1 (ignored)
fnasgnm
./checkmany.sh: -s}: not found
./checkmany.sh: _fnasgnm: not found
./checkmany.sh: _fnasgnm: not found
gmake[2]: [Makefile:3689: fnasgnm] Error 1 (ignored)
fnmisc
./checkmany.sh: -s}: not found
./checkmany.sh: _fnmisc: not found
./checkmany.sh: _fnmisc: not found
gmake[2]: [Makefile:3694: fnmisc] Error 1 (ignored)
fordel
./checkmany.sh: -s}: not found
./checkmany.sh: _fordel: not found
./checkmany.sh: _fordel: not found
gmake[2]: [Makefile:3699: fordel] Error 1 (ignored)
forref
./checkmany.sh: -s}: not found
./checkmany.sh: _forref: not found
./checkmany.sh: _forref: not found
gmake[2]: [Makefile:3704: forref] Error 1 (ignored)
forsimp
./checkmany.sh: -s}: not found
./checkmany.sh: _forsimp: not found
./checkmany.sh: _forsimp: not found
gmake[2]: [Makefile:3709: forsimp] Error 1 (ignored)
fsbs
./checkmany.sh: -s}: not found
./checkmany.sh: _fsbs: not found
./checkmany.sh: _fsbs: not found
gmake[2]: [Makefile:3714: fsbs] Error 1 (ignored)
fscaret
./checkmany.sh: -s}: not found
./checkmany.sh: _fscaret: not found
./checkmany.sh: _fscaret: not found
gmake[2]: [Makefile:3719: fscaret] Error 1 (ignored)
fsnul1
./checkmany.sh: -s}: not found
./checkmany.sh: _fsnul1: not found
./checkmany.sh: _fsnul1: not found
gmake[2]: [Makefile:3724: fsnul1] Error 1 (ignored)
fsrs
./checkmany.sh: -s}: not found
./checkmany.sh: _fsrs: not found
./checkmany.sh: _fsrs: not found
gmake[2]: [Makefile:3729: fsrs] Error 1 (ignored)
fsspcoln
./checkmany.sh: -s}: not found
./checkmany.sh: _fsspcoln: not found
./checkmany.sh: _fsspcoln: not found
gmake[2]: [Makefile:2758: fsspcoln] Error 1 (ignored)
fstabplus
./checkmany.sh: -s}: not found
./checkmany.sh: _fstabplus: not found
./checkmany.sh: _fstabplus: not found
gmake[2]: [Makefile:3734: fstabplus] Error 1 (ignored)
funsemnl
./checkmany.sh: -s}: not found
./checkmany.sh: _funsemnl: not found
./checkmany.sh: _funsemnl: not found
gmake[2]: [Makefile:3739: funsemnl] Error 1 (ignored)
funsmnam
./checkmany.sh: -s}: not found
./checkmany.sh: _funsmnam: not found
./checkmany.sh: _funsmnam: not found
gmake[2]: [Makefile:3744: funsmnam] Error 1 (ignored)
funstack
./checkmany.sh: -s}: not found
./checkmany.sh: _funstack: not found
./checkmany.sh: _funstack: not found
gmake[2]: [Makefile:3749: funstack] Error 1 (ignored)
getline
./checkmany.sh: -s}: not found
./checkmany.sh: _getline: not found
./checkmany.sh: _getline: not found
gmake[2]: [Makefile:3754: getline] Error 1 (ignored)
getline2
./checkmany.sh: -s}: not found
./checkmany.sh: _getline2: not found
./checkmany.sh: _getline2: not found
gmake[2]: [Makefile:2606: getline2] Error 1 (ignored)
getline3
./checkmany.sh: -s}: not found
./checkmany.sh: _getline3: not found
./checkmany.sh: _getline3: not found
gmake[2]: [Makefile:3759: getline3] Error 1 (ignored)
getline4
./checkmany.sh: -s}: not found
./checkmany.sh: _getline4: not found
./checkmany.sh: _getline4: not found
gmake[2]: [Makefile:3764: getline4] Error 1 (ignored)
getline5
./checkmany.sh: -s}: not found
./checkmany.sh: _getline5: not found
./checkmany.sh: _getline5: not found
gmake[2]: [Makefile:3769: getline5] Error 1 (ignored)
getlnbuf
getlnfa
./checkmany.sh: -s}: not found
./checkmany.sh: _getlnfa: not found
./checkmany.sh: _getlnfa: not found
gmake[2]: [Makefile:3774: getlnfa] Error 1 (ignored)
getnr2tb
./checkmany.sh: -s}: not found
./checkmany.sh: _getnr2tb: not found
./checkmany.sh: _getnr2tb: not found
gmake[2]: [Makefile:3779: getnr2tb] Error 1 (ignored)
getnr2tm
./checkmany.sh: -s}: not found
./checkmany.sh: _getnr2tm: not found
./checkmany.sh: _getnr2tm: not found
gmake[2]: [Makefile:3784: getnr2tm] Error 1 (ignored)
greek-equiv
./checkmany.sh: -s}: not found
./checkmany.sh: _greek-equiv: not found
./checkmany.sh: _greek-equiv: not found
./checkmany.sh: _greek-equiv: not found
./checkmany.sh: _greek-equiv: not found
gmake[2]: [Makefile:3789: greek-equiv] Error 1 (ignored)
greek-utf
./checkmany.sh: -s}: not found
./checkmany.sh: _greek-utf: not found
./checkmany.sh: _greek-utf: not found
./checkmany.sh: _greek-utf: not found
./checkmany.sh: _greek-utf: not found
gmake[2]: [Makefile:3795: greek-utf] Error 1 (ignored)
gsubasgn
./checkmany.sh: -s}: not found
./checkmany.sh: _gsubasgn: not found
./checkmany.sh: _gsubasgn: not found
gmake[2]: [Makefile:3801: gsubasgn] Error 1 (ignored)
gsubnulli18n
./checkmany.sh: -s}: not found
./checkmany.sh: _gsubnulli18n: not found
./checkmany.sh: _gsubnulli18n: not found
./checkmany.sh: _gsubnulli18n: not found
./checkmany.sh: _gsubnulli18n: not found
gmake[2]: [Makefile:3806: gsubnulli18n] Error 1 (ignored)
gsubtest
./checkmany.sh: -s}: not found
./checkmany.sh: _gsubtest: not found
./checkmany.sh: _gsubtest: not found
gmake[2]: [Makefile:3812: gsubtest] Error 1 (ignored)
gsubtst2
./checkmany.sh: -s}: not found
./checkmany.sh: _gsubtst2: not found
./checkmany.sh: _gsubtst2: not found
gmake[2]: [Makefile:3817: gsubtst2] Error 1 (ignored)
gsubtst3
./checkmany.sh: -s}: not found
./checkmany.sh: _gsubtst3: not found
./checkmany.sh: _gsubtst3: not found
gmake[2]: [Makefile:3822: gsubtst3] Error 1 (ignored)
gsubtst4
./checkmany.sh: -s}: not found
./checkmany.sh: _gsubtst4: not found
./checkmany.sh: _gsubtst4: not found
gmake[2]: [Makefile:3827: gsubtst4] Error 1 (ignored)
gsubtst5
./checkmany.sh: -s}: not found
./checkmany.sh: _gsubtst5: not found
./checkmany.sh: _gsubtst5: not found
./checkmany.sh: _gsubtst5: not found
./checkmany.sh: _gsubtst5: not found
gmake[2]: [Makefile:3832: gsubtst5] Error 1 (ignored)
gsubtst6
./checkmany.sh: -s}: not found
./checkmany.sh: _gsubtst6: not found
./checkmany.sh: _gsubtst6: not found
gmake[2]: [Makefile:3837: gsubtst6] Error 1 (ignored)
gsubtst7
./checkmany.sh: -s}: not found
./checkmany.sh: _gsubtst7: not found
./checkmany.sh: _gsubtst7: not found
gmake[2]: [Makefile:3843: gsubtst7] Error 1 (ignored)
gsubtst8
./checkmany.sh: -s}: not found
./checkmany.sh: _gsubtst8: not found
./checkmany.sh: _gsubtst8: not found
gmake[2]: [Makefile:3848: gsubtst8] Error 1 (ignored)
hex
./checkmany.sh: -s}: not found
./checkmany.sh: _hex: not found
./checkmany.sh: _hex: not found
gmake[2]: [Makefile:3853: hex] Error 1 (ignored)
hex2
./checkmany.sh: -s}: not found
./checkmany.sh: _hex2: not found
./checkmany.sh: _hex2: not found
gmake[2]: [Makefile:3858: hex2] Error 1 (ignored)
hex3
./checkmany.sh: -s}: not found
./checkmany.sh: _hex3: not found
./checkmany.sh: _hex3: not found
gmake[2]: [Makefile:3863: hex3] Error 1 (ignored)
hsprint
./checkmany.sh: -s}: not found
./checkmany.sh: _hsprint: not found
./checkmany.sh: _hsprint: not found
gmake[2]: [Makefile:3868: hsprint] Error 1 (ignored)
inpref
./checkmany.sh: -s}: not found
./checkmany.sh: _inpref: not found
./checkmany.sh: _inpref: not found
gmake[2]: [Makefile:3873: inpref] Error 1 (ignored)
inputred
./checkmany.sh: -s}: not found
./checkmany.sh: _inputred: not found
./checkmany.sh: _inputred: not found
gmake[2]: [Makefile:3878: inputred] Error 1 (ignored)
intest
./checkmany.sh: -s}: not found
./checkmany.sh: _intest: not found
./checkmany.sh: _intest: not found
gmake[2]: [Makefile:3883: intest] Error 1 (ignored)
intprec
./checkmany.sh: -s}: not found
./checkmany.sh: _intprec: not found
./checkmany.sh: _intprec: not found
gmake[2]: [Makefile:3888: intprec] Error 1 (ignored)
iobug1
./checkmany.sh: -s}: not found
./checkmany.sh: _iobug1: not found
./checkmany.sh: _iobug1: not found
gmake[2]: [Makefile:3893: iobug1] Error 1 (ignored)
leaddig
./checkmany.sh: -s}: not found
./checkmany.sh: _leaddig: not found
./checkmany.sh: _leaddig: not found
gmake[2]: [Makefile:3898: leaddig] Error 1 (ignored)
leadnl
./checkmany.sh: -s}: not found
./checkmany.sh: _leadnl: not found
./checkmany.sh: _leadnl: not found
gmake[2]: [Makefile:3903: leadnl] Error 1 (ignored)
litoct
./checkmany.sh: -s}: not found
./checkmany.sh: _litoct: not found
./checkmany.sh: _litoct: not found
gmake[2]: [Makefile:3908: litoct] Error 1 (ignored)
longsub
./checkmany.sh: -s}: not found
./checkmany.sh: _longsub: not found
./checkmany.sh: _longsub: not found
gmake[2]: [Makefile:3913: longsub] Error 1 (ignored)
longwrds
./checkmany.sh: -s}: not found
./checkmany.sh: _longwrds: not found
./checkmany.sh: _longwrds: not found
gmake[2]: [Makefile:3225: longwrds] Error 1 (ignored)
manglprm
./checkmany.sh: -s}: not found
./checkmany.sh: _manglprm: not found
./checkmany.sh: _manglprm: not found
gmake[2]: [Makefile:3918: manglprm] Error 1 (ignored)
match4
./checkmany.sh: -s}: not found
./checkmany.sh: _match4: not found
./checkmany.sh: _match4: not found
gmake[2]: [Makefile:3923: match4] Error 1 (ignored)
match5
./checkmany.sh: -s}: not found
./checkmany.sh: _match5: not found
./checkmany.sh: _match5: not found
gmake[2]: [Makefile:3928: match5] Error 1 (ignored)
matchbadarg1
./checkmany.sh: -s}: not found
./checkmany.sh: _matchbadarg1: not found
./checkmany.sh: _matchbadarg1: not found
gmake[2]: [Makefile:3933: matchbadarg1] Error 1 (ignored)
matchbadarg2
./checkmany.sh: -s}: not found
./checkmany.sh: _matchbadarg2: not found
./checkmany.sh: _matchbadarg2: not found
gmake[2]: [Makefile:3938: matchbadarg2] Error 1 (ignored)
matchuninitialized
./checkmany.sh: -s}: not found
./checkmany.sh: _matchuninitialized: not found
./checkmany.sh: _matchuninitialized: not found
gmake[2]: [Makefile:3943: matchuninitialized] Error 1 (ignored)
math
./checkmany.sh: -s}: not found
./checkmany.sh: _math: not found
./checkmany.sh: _math: not found
gmake[2]: [Makefile:3948: math] Error 1 (ignored)
membug1
./checkmany.sh: -s}: not found
./checkmany.sh: _membug1: not found
./checkmany.sh: _membug1: not found
gmake[2]: [Makefile:3953: membug1] Error 1 (ignored)
memleak
./checkmany.sh: -s}: not found
./checkmany.sh: _memleak: not found
./checkmany.sh: _memleak: not found
gmake[2]: [Makefile:3958: memleak] Error 1 (ignored)
memleak4
./checkmany.sh: -s}: not found
./checkmany.sh: _memleak4: not found
./checkmany.sh: _memleak4: not found
gmake[2]: [Makefile:3963: memleak4] Error 1 (ignored)
messages
minusstr
./checkmany.sh: -s}: not found
./checkmany.sh: _minusstr: not found
./checkmany.sh: _minusstr: not found
gmake[2]: [Makefile:3968: minusstr] Error 1 (ignored)
mmap8k
./checkmany.sh: -s}: not found
./checkmany.sh: _mmap8k: not found
./checkmany.sh: _mmap8k: not found
gmake[2]: [Makefile:3973: mmap8k] Error 1 (ignored)
nasty
./checkmany.sh: -s}: not found
./checkmany.sh: _nasty: not found
./checkmany.sh: _nasty: not found
gmake[2]: [Makefile:3978: nasty] Error 1 (ignored)
nasty2
./checkmany.sh: -s}: not found
./checkmany.sh: _nasty2: not found
./checkmany.sh: _nasty2: not found
gmake[2]: [Makefile:3983: nasty2] Error 1 (ignored)
negexp
./checkmany.sh: -s}: not found
./checkmany.sh: _negexp: not found
./checkmany.sh: _negexp: not found
gmake[2]: [Makefile:3988: negexp] Error 1 (ignored)
negrange
./checkmany.sh: -s}: not found
./checkmany.sh: _negrange: not found
./checkmany.sh: _negrange: not found
gmake[2]: [Makefile:3993: negrange] Error 1 (ignored)
nested
./checkmany.sh: -s}: not found
./checkmany.sh: _nested: not found
./checkmany.sh: _nested: not found
gmake[2]: [Makefile:3998: nested] Error 1 (ignored)
nfldstr
./checkmany.sh: -s}: not found
./checkmany.sh: _nfldstr: not found
./checkmany.sh: _nfldstr: not found
gmake[2]: [Makefile:4003: nfldstr] Error 1 (ignored)
nfloop
./checkmany.sh: -s}: not found
./checkmany.sh: _nfloop: not found
./checkmany.sh: _nfloop: not found
gmake[2]: [Makefile:4008: nfloop] Error 1 (ignored)
nfneg
./checkmany.sh: -s}: not found
./checkmany.sh: _nfneg: not found
./checkmany.sh: _nfneg: not found
gmake[2]: [Makefile:4013: nfneg] Error 1 (ignored)
nfset
./checkmany.sh: -s}: not found
./checkmany.sh: _nfset: not found
./checkmany.sh: _nfset: not found
gmake[2]: [Makefile:4018: nfset] Error 1 (ignored)
nlfldsep
./checkmany.sh: -s}: not found
./checkmany.sh: _nlfldsep: not found
./checkmany.sh: _nlfldsep: not found
gmake[2]: [Makefile:4023: nlfldsep] Error 1 (ignored)
nlinstr
./checkmany.sh: -s}: not found
./checkmany.sh: _nlinstr: not found
./checkmany.sh: _nlinstr: not found
gmake[2]: [Makefile:4028: nlinstr] Error 1 (ignored)
nlstrina
./checkmany.sh: -s}: not found
./checkmany.sh: _nlstrina: not found
./checkmany.sh: _nlstrina: not found
gmake[2]: [Makefile:4033: nlstrina] Error 1 (ignored)
noeffect
./checkmany.sh: -s}: not found
./checkmany.sh: _noeffect: not found
./checkmany.sh: _noeffect: not found
gmake[2]: [Makefile:4038: noeffect] Error 1 (ignored)
nofile
./checkmany.sh: -s}: not found
./checkmany.sh: _nofile: not found
./checkmany.sh: _nofile: not found
./checkmany.sh: _nofile: not found
./checkmany.sh: _nofile: not found
gmake[2]: [Makefile:2776: nofile] Error 1 (ignored)
nofmtch
./checkmany.sh: -s}: not found
./checkmany.sh: _nofmtch: not found
./checkmany.sh: _nofmtch: not found
gmake[2]: [Makefile:4043: nofmtch] Error 1 (ignored)
noloop1
./checkmany.sh: -s}: not found
./checkmany.sh: _noloop1: not found
./checkmany.sh: _noloop1: not found
gmake[2]: [Makefile:4048: noloop1] Error 1 (ignored)
noloop2
./checkmany.sh: -s}: not found
./checkmany.sh: _noloop2: not found
./checkmany.sh: _noloop2: not found
gmake[2]: [Makefile:4053: noloop2] Error 1 (ignored)
nonl
./checkmany.sh: -s}: not found
./checkmany.sh: _nonl: not found
./checkmany.sh: _nonl: not found
gmake[2]: [Makefile:4058: nonl] Error 1 (ignored)
noparms
./checkmany.sh: -s}: not found
./checkmany.sh: _noparms: not found
./checkmany.sh: _noparms: not found
gmake[2]: [Makefile:4063: noparms] Error 1 (ignored)
nors
./checkmany.sh: -s}: not found
./checkmany.sh: _nors: not found
./checkmany.sh: _nors: not found
gmake[2]: [Makefile:2665: nors] Error 1 (ignored)
nulinsrc
./checkmany.sh: -s}: not found
./checkmany.sh: _nulinsrc: not found
./checkmany.sh: _nulinsrc: not found
gmake[2]: [Makefile:4068: nulinsrc] Error 1 (ignored)
nulrsend
./checkmany.sh: -s}: not found
./checkmany.sh: _nulrsend: not found
./checkmany.sh: _nulrsend: not found
gmake[2]: [Makefile:4073: nulrsend] Error 1 (ignored)
numindex
./checkmany.sh: -s}: not found
./checkmany.sh: _numindex: not found
./checkmany.sh: _numindex: not found
gmake[2]: [Makefile:4078: numindex] Error 1 (ignored)
numrange
./checkmany.sh: -s}: not found
./checkmany.sh: _numrange: not found
./checkmany.sh: _numrange: not found
./checkmany.sh: _numrange: not found
./checkmany.sh: _numrange: not found
./checkmany.sh: _numrange: not found
./checkmany.sh: _numrange: not found
gmake[2]: [Makefile:4083: numrange] Error 1 (ignored)
numstr1
./checkmany.sh: -s}: not found
./checkmany.sh: _numstr1: not found
./checkmany.sh: _numstr1: not found
gmake[2]: [Makefile:4088: numstr1] Error 1 (ignored)
numsubstr
./checkmany.sh: -s}: not found
./checkmany.sh: _numsubstr: not found
./checkmany.sh: _numsubstr: not found
gmake[2]: [Makefile:4093: numsubstr] Error 1 (ignored)
octsub
./checkmany.sh: -s}: not found
./checkmany.sh: _octsub: not found
./checkmany.sh: _octsub: not found
gmake[2]: [Makefile:4098: octsub] Error 1 (ignored)
ofmt
./checkmany.sh: -s}: not found
./checkmany.sh: _ofmt: not found
./checkmany.sh: _ofmt: not found
gmake[2]: [Makefile:4103: ofmt] Error 1 (ignored)
ofmta
./checkmany.sh: -s}: not found
./checkmany.sh: _ofmta: not found
./checkmany.sh: _ofmta: not found
gmake[2]: [Makefile:4108: ofmta] Error 1 (ignored)
ofmtbig
./checkmany.sh: -s}: not found
./checkmany.sh: _ofmtbig: not found
./checkmany.sh: _ofmtbig: not found
gmake[2]: [Makefile:4113: ofmtbig] Error 1 (ignored)
ofmtfidl
./checkmany.sh: -s}: not found
./checkmany.sh: _ofmtfidl: not found
./checkmany.sh: _ofmtfidl: not found
gmake[2]: [Makefile:4118: ofmtfidl] Error 1 (ignored)
ofmts
./checkmany.sh: -s}: not found
ofmtstrnum
./checkmany.sh: _ofmts: not found
./checkmany.sh: _ofmts: not found
gmake[2]: [Makefile:4123: ofmts] Error 1 (ignored)
./checkmany.sh: -s}: not found
./checkmany.sh: _ofmtstrnum: not found
./checkmany.sh: _ofmtstrnum: not found
gmake[2]: [Makefile:4128: ofmtstrnum] Error 1 (ignored)
ofs1
./checkmany.sh: -s}: not found
./checkmany.sh: _ofs1: not found
./checkmany.sh: _ofs1: not found
gmake[2]: [Makefile:4133: ofs1] Error 1 (ignored)
onlynl
./checkmany.sh: -s}: not found
./checkmany.sh: _onlynl: not found
./checkmany.sh: _onlynl: not found
gmake[2]: [Makefile:4138: onlynl] Error 1 (ignored)
opasnidx
./checkmany.sh: -s}: not found
./checkmany.sh: _opasnidx: not found
./checkmany.sh: _opasnidx: not found
gmake[2]: [Makefile:4143: opasnidx] Error 1 (ignored)
opasnslf
./checkmany.sh: -s}: not found
./checkmany.sh: _opasnslf: not found
./checkmany.sh: _opasnslf: not found
gmake[2]: [Makefile:4148: opasnslf] Error 1 (ignored)
paramasfunc1
./checkmany.sh: -s}: not found
./checkmany.sh: _paramasfunc1: not found
./checkmany.sh: _paramasfunc1: not found
gmake[2]: [Makefile:4153: paramasfunc1] Error 1 (ignored)
paramasfunc2
./checkmany.sh: -s}: not found
./checkmany.sh: _paramasfunc2: not found
./checkmany.sh: _paramasfunc2: not found
gmake[2]: [Makefile:4158: paramasfunc2] Error 1 (ignored)
paramdup
./checkmany.sh: -s}: not found
./checkmany.sh: _paramdup: not found
./checkmany.sh: _paramdup: not found
gmake[2]: [Makefile:4163: paramdup] Error 1 (ignored)
paramres
./checkmany.sh: -s}: not found
./checkmany.sh: _paramres: not found
./checkmany.sh: _paramres: not found
gmake[2]: [Makefile:4168: paramres] Error 1 (ignored)
paramtyp
./checkmany.sh: -s}: not found
./checkmany.sh: _paramtyp: not found
./checkmany.sh: _paramtyp: not found
gmake[2]: [Makefile:4173: paramtyp] Error 1 (ignored)
paramuninitglobal
./checkmany.sh: -s}: not found
./checkmany.sh: _paramuninitglobal: not found
./checkmany.sh: _paramuninitglobal: not found
gmake[2]: [Makefile:4178: paramuninitglobal] Error 1 (ignored)
parse1
./checkmany.sh: -s}: not found
./checkmany.sh: _parse1: not found
./checkmany.sh: _parse1: not found
gmake[2]: [Makefile:4183: parse1] Error 1 (ignored)
parsefld
./checkmany.sh: -s}: not found
./checkmany.sh: _parsefld: not found
./checkmany.sh: _parsefld: not found
gmake[2]: [Makefile:4188: parsefld] Error 1 (ignored)
parseme
./checkmany.sh: -s}: not found
./checkmany.sh: _parseme: not found
./checkmany.sh: _parseme: not found
gmake[2]: [Makefile:4193: parseme] Error 1 (ignored)
pcntplus
./checkmany.sh: -s}: not found
./checkmany.sh: _pcntplus: not found
./checkmany.sh: _pcntplus: not found
gmake[2]: [Makefile:4198: pcntplus] Error 1 (ignored)
posix-inf
./checkmany.sh: -s}: not found
./checkmany.sh: _posix-inf: not found
./checkmany.sh: _posix-inf: not found
./checkmany.sh: _posix-inf: not found
./checkmany.sh: _posix-inf: not found
./checkmany.sh: _posix-inf: not found
./checkmany.sh: _posix-inf: not found
gmake[2]: [Makefile:4203: posix-inf] Error 1 (ignored)
posix2008sub
./checkmany.sh: -s}: not found
./checkmany.sh: _posix2008sub: not found
./checkmany.sh: _posix2008sub: not found
gmake[2]: [Makefile:4208: posix2008sub] Error 1 (ignored)
posix_compare
./checkmany.sh: -s}: not found
./checkmany.sh: _posix_compare: not found
./checkmany.sh: _posix_compare: not found
./checkmany.sh: _posix_compare: not found
./checkmany.sh: _posix_compare: not found
gmake[2]: [Makefile:4213: posix_compare] Error 1 (ignored)
prdupval
./checkmany.sh: -s}: not found
./checkmany.sh: _prdupval: not found
./checkmany.sh: _prdupval: not found
gmake[2]: [Makefile:4219: prdupval] Error 1 (ignored)
prec
./checkmany.sh: -s}: not found
./checkmany.sh: _prec: not found
./checkmany.sh: _prec: not found
gmake[2]: [Makefile:4224: prec] Error 1 (ignored)
printf-corners
./checkmany.sh: -s}: not found
./checkmany.sh: _printf-corners: not found
./checkmany.sh: _printf-corners: not found
./checkmany.sh: _printf-corners: not found
./checkmany.sh: _printf-corners: not found
./checkmany.sh: _printf-corners: not found
./checkmany.sh: _printf-corners: not found
gmake[2]: [Makefile:4229: printf-corners] Error 1 (ignored)
printf0
./checkmany.sh: -s}: not found
./checkmany.sh: _printf0: not found
./checkmany.sh: _printf0: not found
gmake[2]: [Makefile:4234: printf0] Error 1 (ignored)
printf1
./checkmany.sh: -s}: not found
./checkmany.sh: _printf1: not found
./checkmany.sh: _printf1: not found
gmake[2]: [Makefile:4239: printf1] Error 1 (ignored)
printfchar
./checkmany.sh: -s}: not found
./checkmany.sh: _printfchar: not found
./checkmany.sh: _printfchar: not found
gmake[2]: [Makefile:4244: printfchar] Error 1 (ignored)
prmarscl
./checkmany.sh: -s}: not found
./checkmany.sh: _prmarscl: not found
./checkmany.sh: _prmarscl: not found
gmake[2]: [Makefile:4249: prmarscl] Error 1 (ignored)
prmreuse
./checkmany.sh: -s}: not found
./checkmany.sh: _prmreuse: not found
./checkmany.sh: _prmreuse: not found
gmake[2]: [Makefile:4254: prmreuse] Error 1 (ignored)
prt1eval
./checkmany.sh: -s}: not found
./checkmany.sh: _prt1eval: not found
./checkmany.sh: _prt1eval: not found
gmake[2]: [Makefile:4259: prt1eval] Error 1 (ignored)
prtoeval
./checkmany.sh: -s}: not found
./checkmany.sh: _prtoeval: not found
./checkmany.sh: _prtoeval: not found
gmake[2]: [Makefile:4264: prtoeval] Error 1 (ignored)
rand
./checkmany.sh: -s}: not found
./checkmany.sh: _rand: not found
./checkmany.sh: _rand: not found
./checkmany.sh: _rand: not found
./checkmany.sh: _rand: not found
gmake[2]: [Makefile:4269: rand] Error 1 (ignored)
randtest
./checkmany.sh: -s}: not found
./checkmany.sh: _randtest: not found
./checkmany.sh: _randtest: not found
gmake[2]: [Makefile:4274: randtest] Error 1 (ignored)
range1
./checkmany.sh: -s}: not found
./checkmany.sh: _range1: not found
./checkmany.sh: _range1: not found
gmake[2]: [Makefile:4279: range1] Error 1 (ignored)
range2
./checkmany.sh: -s}: not found
./checkmany.sh: _range2: not found
./checkmany.sh: _range2: not found
gmake[2]: [Makefile:4284: range2] Error 1 (ignored)
readbuf
./checkmany.sh: -s}: not found
./checkmany.sh: _readbuf: not found
./checkmany.sh: _readbuf: not found
gmake[2]: [Makefile:4290: readbuf] Error 1 (ignored)
rebrackloc
./checkmany.sh: -s}: not found
./checkmany.sh: _rebrackloc: not found
./checkmany.sh: _rebrackloc: not found
gmake[2]: [Makefile:4295: rebrackloc] Error 1 (ignored)
rebt8b1
./checkmany.sh: -s}: not found
./checkmany.sh: _rebt8b1: not found
./checkmany.sh: _rebt8b1: not found
gmake[2]: [Makefile:4300: rebt8b1] Error 1 (ignored)
rebuild
./checkmany.sh: -s}: not found
./checkmany.sh: _rebuild: not found
./checkmany.sh: _rebuild: not found
gmake[2]: [Makefile:4305: rebuild] Error 1 (ignored)
redfilnm
./checkmany.sh: -s}: not found
./checkmany.sh: _redfilnm: not found
./checkmany.sh: _redfilnm: not found
gmake[2]: [Makefile:2725: redfilnm] Error 1 (ignored)
regeq
./checkmany.sh: -s}: not found
./checkmany.sh: _regeq: not found
./checkmany.sh: _regeq: not found
gmake[2]: [Makefile:4310: regeq] Error 1 (ignored)
regex3minus
./checkmany.sh: -s}: not found
./checkmany.sh: _regex3minus: not found
./checkmany.sh: _regex3minus: not found
gmake[2]: [Makefile:4315: regex3minus] Error 1 (ignored)
regexpbad
./checkmany.sh: -s}: not found
./checkmany.sh: _regexpbad: not found
./checkmany.sh: _regexpbad: not found
./checkmany.sh: _regexpbad: not found
./checkmany.sh: _regexpbad: not found
gmake[2]: [Makefile:4320: regexpbad] Error 1 (ignored)
regexpbrack
./checkmany.sh: -s}: not found
./checkmany.sh: _regexpbrack: not found
./checkmany.sh: _regexpbrack: not found
gmake[2]: [Makefile:4325: regexpbrack] Error 1 (ignored)
regexpbrack2
./checkmany.sh: -s}: not found
./checkmany.sh: _regexpbrack2: not found
./checkmany.sh: _regexpbrack2: not found
gmake[2]: [Makefile:4330: regexpbrack2] Error 1 (ignored)
regexpbrack3
./checkmany.sh: -s}: not found
./checkmany.sh: _regexpbrack3: not found
./checkmany.sh: _regexpbrack3: not found
gmake[2]: [Makefile:4335: regexpbrack3] Error 1 (ignored)
regexprange
./checkmany.sh: -s}: not found
./checkmany.sh: _regexprange: not found
./checkmany.sh: _regexprange: not found
gmake[2]: [Makefile:4340: regexprange] Error 1 (ignored)
regexpuparrow
./checkmany.sh: -s}: not found
./checkmany.sh: _regexpuparrow: not found
./checkmany.sh: _regexpuparrow: not found
gmake[2]: [Makefile:4345: regexpuparrow] Error 1 (ignored)
regrange
./checkmany.sh: -s}: not found
./checkmany.sh: _regrange: not found
./checkmany.sh: _regrange: not found
./checkmany.sh: _regrange: not found
./checkmany.sh: _regrange: not found
gmake[2]: [Makefile:4350: regrange] Error 1 (ignored)
reindops
./checkmany.sh: -s}: not found
./checkmany.sh: _reindops: not found
./checkmany.sh: _reindops: not found
gmake[2]: [Makefile:4355: reindops] Error 1 (ignored)
reparse
./checkmany.sh: -s}: not found
./checkmany.sh: _reparse: not found
./checkmany.sh: _reparse: not found
gmake[2]: [Makefile:4360: reparse] Error 1 (ignored)
resplit
./checkmany.sh: -s}: not found
./checkmany.sh: _resplit: not found
./checkmany.sh: _resplit: not found
gmake[2]: [Makefile:4365: resplit] Error 1 (ignored)
rri1
./checkmany.sh: -s}: not found
./checkmany.sh: _rri1: not found
./checkmany.sh: _rri1: not found
./checkmany.sh: _rri1: not found
./checkmany.sh: _rri1: not found
gmake[2]: [Makefile:4370: rri1] Error 1 (ignored)
rs
./checkmany.sh: -s}: not found
./checkmany.sh: _rs: not found
./checkmany.sh: _rs: not found
gmake[2]: [Makefile:4376: rs] Error 1 (ignored)
rscompat
./checkmany.sh: -s}: not found
./checkmany.sh: _rscompat: not found
./checkmany.sh: _rscompat: not found
gmake[2]: [Makefile:4381: rscompat] Error 1 (ignored)
rsnul1nl
./checkmany.sh: -s}: not found
./checkmany.sh: _rsnul1nl: not found
./checkmany.sh: _rsnul1nl: not found
gmake[2]: [Makefile:4386: rsnul1nl] Error 1 (ignored)
rsnulbig
./checkmany.sh: -s}: not found
./checkmany.sh: _rsnulbig: not found
./checkmany.sh: _rsnulbig: not found
gmake[2]: [Makefile:2736: rsnulbig] Error 1 (ignored)
rsnulbig2
./checkmany.sh: -s}: not found
./checkmany.sh: _rsnulbig2: not found
./checkmany.sh: _rsnulbig2: not found
gmake[2]: [Makefile:2743: rsnulbig2] Error 1 (ignored)
rsnullre
./checkmany.sh: -s}: not found
./checkmany.sh: _rsnullre: not found
./checkmany.sh: _rsnullre: not found
gmake[2]: [Makefile:4391: rsnullre] Error 1 (ignored)
rsnulw
./checkmany.sh: -s}: not found
./checkmany.sh: _rsnulw: not found
./checkmany.sh: _rsnulw: not found
gmake[2]: [Makefile:4396: rsnulw] Error 1 (ignored)
rstest1
./checkmany.sh: -s}: not found
./checkmany.sh: _rstest1: not found
./checkmany.sh: _rstest1: not found
gmake[2]: [Makefile:4401: rstest1] Error 1 (ignored)
rstest2
./checkmany.sh: -s}: not found
./checkmany.sh: _rstest2: not found
./checkmany.sh: _rstest2: not found
gmake[2]: [Makefile:4406: rstest2] Error 1 (ignored)
rstest3
./checkmany.sh: -s}: not found
./checkmany.sh: _rstest3: not found
./checkmany.sh: _rstest3: not found
gmake[2]: [Makefile:4411: rstest3] Error 1 (ignored)
rstest4
./checkmany.sh: -s}: not found
./checkmany.sh: _rstest4: not found
./checkmany.sh: _rstest4: not found
gmake[2]: [Makefile:4416: rstest4] Error 1 (ignored)
rstest5
./checkmany.sh: -s}: not found
./checkmany.sh: _rstest5: not found
./checkmany.sh: _rstest5: not found
gmake[2]: [Makefile:4421: rstest5] Error 1 (ignored)
rswhite
./checkmany.sh: -s}: not found
./checkmany.sh: _rswhite: not found
./checkmany.sh: _rswhite: not found
gmake[2]: [Makefile:4426: rswhite] Error 1 (ignored)
scalar
./checkmany.sh: -s}: not found
./checkmany.sh: _scalar: not found
./checkmany.sh: _scalar: not found
gmake[2]: [Makefile:4431: scalar] Error 1 (ignored)
sclforin
./checkmany.sh: -s}: not found
./checkmany.sh: _sclforin: not found
./checkmany.sh: _sclforin: not found
gmake[2]: [Makefile:4436: sclforin] Error 1 (ignored)
sclifin
./checkmany.sh: -s}: not found
./checkmany.sh: _sclifin: not found
./checkmany.sh: _sclifin: not found
gmake[2]: [Makefile:4441: sclifin] Error 1 (ignored)
setrec0
./checkmany.sh: -s}: not found
./checkmany.sh: _setrec0: not found
./checkmany.sh: _setrec0: not found
gmake[2]: [Makefile:4446: setrec0] Error 1 (ignored)
setrec1
./checkmany.sh: -s}: not found
./checkmany.sh: _setrec1: not found
./checkmany.sh: _setrec1: not found
gmake[2]: [Makefile:4451: setrec1] Error 1 (ignored)
shortest-match
./checkmany.sh: -s}: not found
./checkmany.sh: _shortest-match: not found
./checkmany.sh: _shortest-match: not found
gmake[2]: [Makefile:4456: shortest-match] Error 1 (ignored)
sigpipe1
./checkmany.sh: -s}: not found
./checkmany.sh: _sigpipe1: not found
./checkmany.sh: _sigpipe1: not found
./checkmany.sh: _sigpipe1: not found
./checkmany.sh: _sigpipe1: not found
gmake[2]: [Makefile:4461: sigpipe1] Error 1 (ignored)
sortempty
./checkmany.sh: -s}: not found
./checkmany.sh: _sortempty: not found
./checkmany.sh: _sortempty: not found
gmake[2]: [Makefile:4466: sortempty] Error 1 (ignored)
sortglos
./checkmany.sh: -s}: not found
./checkmany.sh: _sortglos: not found
./checkmany.sh: _sortglos: not found
gmake[2]: [Makefile:4471: sortglos] Error 1 (ignored)
spacere
./checkmany.sh: -s}: not found
./checkmany.sh: _spacere: not found
./checkmany.sh: _spacere: not found
gmake[2]: [Makefile:3235: spacere] Error 1 (ignored)
splitany
./checkmany.sh: -s}: not found
./checkmany.sh: _splitany: not found
./checkmany.sh: _splitany: not found
gmake[2]: [Makefile:4476: splitany] Error 1 (ignored)
splitargv
./checkmany.sh: -s}: not found
./checkmany.sh: _splitargv: not found
./checkmany.sh: _splitargv: not found
gmake[2]: [Makefile:4481: splitargv] Error 1 (ignored)
splitarr
./checkmany.sh: -s}: not found
./checkmany.sh: _splitarr: not found
./checkmany.sh: _splitarr: not found
gmake[2]: [Makefile:4486: splitarr] Error 1 (ignored)
splitdef
./checkmany.sh: -s}: not found
./checkmany.sh: _splitdef: not found
./checkmany.sh: _splitdef: not found
gmake[2]: [Makefile:4491: splitdef] Error 1 (ignored)
splitvar
./checkmany.sh: -s}: not found
./checkmany.sh: _splitvar: not found
./checkmany.sh: _splitvar: not found
gmake[2]: [Makefile:4496: splitvar] Error 1 (ignored)
splitwht
./checkmany.sh: -s}: not found
./checkmany.sh: _splitwht: not found
./checkmany.sh: _splitwht: not found
gmake[2]: [Makefile:4501: splitwht] Error 1 (ignored)
splitwht2
./checkmany.sh: -s}: not found
./checkmany.sh: _splitwht2: not found
./checkmany.sh: _splitwht2: not found
gmake[2]: [Makefile:4506: splitwht2] Error 1 (ignored)
status-close
./checkmany.sh: -s}: not found
./checkmany.sh: _status-close: not found
./checkmany.sh: _status-close: not found
gmake[2]: [Makefile:4511: status-close] Error 1 (ignored)
strcat1
./checkmany.sh: -s}: not found
./checkmany.sh: _strcat1: not found
./checkmany.sh: _strcat1: not found
gmake[2]: [Makefile:4516: strcat1] Error 1 (ignored)
strfieldnum
./checkmany.sh: -s}: not found
./checkmany.sh: _strfieldnum: not found
./checkmany.sh: _strfieldnum: not found
gmake[2]: [Makefile:4521: strfieldnum] Error 1 (ignored)
strnum1
./checkmany.sh: -s}: not found
./checkmany.sh: _strnum1: not found
./checkmany.sh: _strnum1: not found
gmake[2]: [Makefile:4526: strnum1] Error 1 (ignored)
strnum2
./checkmany.sh: -s}: not found
./checkmany.sh: _strnum2: not found
./checkmany.sh: _strnum2: not found
gmake[2]: [Makefile:4531: strnum2] Error 1 (ignored)
strsubscript
./checkmany.sh: -s}: not found
./checkmany.sh: _strsubscript: not found
./checkmany.sh: _strsubscript: not found
gmake[2]: [Makefile:4536: strsubscript] Error 1 (ignored)
strtod
./checkmany.sh: -s}: not found
./checkmany.sh: _strtod: not found
./checkmany.sh: _strtod: not found
gmake[2]: [Makefile:4541: strtod] Error 1 (ignored)
subamp
./checkmany.sh: -s}: not found
./checkmany.sh: _subamp: not found
./checkmany.sh: _subamp: not found
./checkmany.sh: _subamp: not found
./checkmany.sh: _subamp: not found
gmake[2]: [Makefile:4546: subamp] Error 1 (ignored)
subback
./checkmany.sh: -s}: not found
./checkmany.sh: _subback: not found
./checkmany.sh: _subback: not found
gmake[2]: [Makefile:4552: subback] Error 1 (ignored)
subi18n
./checkmany.sh: -s}: not found
./checkmany.sh: _subi18n: not found
./checkmany.sh: _subi18n: not found
./checkmany.sh: _subi18n: not found
./checkmany.sh: _subi18n: not found
gmake[2]: [Makefile:4557: subi18n] Error 1 (ignored)
subsepnm
./checkmany.sh: -s}: not found
./checkmany.sh: _subsepnm: not found
./checkmany.sh: _subsepnm: not found
gmake[2]: [Makefile:4563: subsepnm] Error 1 (ignored)
subslash
./checkmany.sh: -s}: not found
./checkmany.sh: _subslash: not found
./checkmany.sh: _subslash: not found
gmake[2]: [Makefile:4568: subslash] Error 1 (ignored)
substr
./checkmany.sh: -s}: not found
./checkmany.sh: _substr: not found
./checkmany.sh: _substr: not found
gmake[2]: [Makefile:4573: substr] Error 1 (ignored)
swaplns
./checkmany.sh: -s}: not found
./checkmany.sh: _swaplns: not found
./checkmany.sh: _swaplns: not found
gmake[2]: [Makefile:4578: swaplns] Error 1 (ignored)
synerr1
./checkmany.sh: -s}: not found
./checkmany.sh: _synerr1: not found
./checkmany.sh: _synerr1: not found
gmake[2]: [Makefile:4583: synerr1] Error 1 (ignored)
synerr2
./checkmany.sh: -s}: not found
./checkmany.sh: _synerr2: not found
./checkmany.sh: _synerr2: not found
gmake[2]: [Makefile:4588: synerr2] Error 1 (ignored)
synerr3
./checkmany.sh: -s}: not found
./checkmany.sh: _synerr3: not found
./checkmany.sh: _synerr3: not found
gmake[2]: [Makefile:4593: synerr3] Error 1 (ignored)
tailrecurse
./checkmany.sh: -s}: not found
./checkmany.sh: _tailrecurse: not found
./checkmany.sh: _tailrecurse: not found
gmake[2]: [Makefile:4598: tailrecurse] Error 1 (ignored)
tradanch
./checkmany.sh: -s}: not found
./checkmany.sh: _tradanch: not found
./checkmany.sh: _tradanch: not found
gmake[2]: [Makefile:4603: tradanch] Error 1 (ignored)
trailbs
./checkmany.sh: -s}: not found
./checkmany.sh: _trailbs: not found
./checkmany.sh: _trailbs: not found
gmake[2]: [Makefile:4608: trailbs] Error 1 (ignored)
tweakfld
./checkmany.sh: -s}: not found
./checkmany.sh: _tweakfld: not found
./checkmany.sh: _tweakfld: not found
gmake[2]: [Makefile:2645: tweakfld] Error 1 (ignored)
uninit2
./checkmany.sh: -s}: not found
./checkmany.sh: _uninit2: not found
./checkmany.sh: _uninit2: not found
gmake[2]: [Makefile:4613: uninit2] Error 1 (ignored)
uninit3
./checkmany.sh: -s}: not found
./checkmany.sh: _uninit3: not found
./checkmany.sh: _uninit3: not found
gmake[2]: [Makefile:4618: uninit3] Error 1 (ignored)
uninit4
./checkmany.sh: -s}: not found
./checkmany.sh: _uninit4: not found
./checkmany.sh: _uninit4: not found
gmake[2]: [Makefile:4623: uninit4] Error 1 (ignored)
uninit5
./checkmany.sh: -s}: not found
./checkmany.sh: _uninit5: not found
./checkmany.sh: _uninit5: not found
gmake[2]: [Makefile:4628: uninit5] Error 1 (ignored)
uninitialized
./checkmany.sh: -s}: not found
./checkmany.sh: _uninitialized: not found
./checkmany.sh: _uninitialized: not found
gmake[2]: [Makefile:4633: uninitialized] Error 1 (ignored)
unterm
./checkmany.sh: -s}: not found
./checkmany.sh: _unterm: not found
./checkmany.sh: _unterm: not found
gmake[2]: [Makefile:4638: unterm] Error 1 (ignored)
uparrfs
./checkmany.sh: -s}: not found
./checkmany.sh: _uparrfs: not found
./checkmany.sh: _uparrfs: not found
gmake[2]: [Makefile:4643: uparrfs] Error 1 (ignored)
uplus
./checkmany.sh: -s}: not found
./checkmany.sh: _uplus: not found
./checkmany.sh: _uplus: not found
gmake[2]: [Makefile:4648: uplus] Error 1 (ignored)
uplus2
./checkmany.sh: -s}: not found
./checkmany.sh: _uplus2: not found
./checkmany.sh: _uplus2: not found
gmake[2]: [Makefile:4653: uplus2] Error 1 (ignored)
wideidx
./checkmany.sh: -s}: not found
./checkmany.sh: _wideidx: not found
./checkmany.sh: _wideidx: not found
./checkmany.sh: _wideidx: not found
./checkmany.sh: _wideidx: not found
gmake[2]: [Makefile:4658: wideidx] Error 1 (ignored)
wideidx2
./checkmany.sh: -s}: not found
./checkmany.sh: _wideidx2: not found
./checkmany.sh: _wideidx2: not found
./checkmany.sh: _wideidx2: not found
./checkmany.sh: _wideidx2: not found
gmake[2]: [Makefile:4664: wideidx2] Error 1 (ignored)
widesub
./checkmany.sh: -s}: not found
./checkmany.sh: _widesub: not found
./checkmany.sh: _widesub: not found
./checkmany.sh: _widesub: not found
./checkmany.sh: _widesub: not found
gmake[2]: [Makefile:4670: widesub] Error 1 (ignored)
widesub2
./checkmany.sh: -s}: not found
./checkmany.sh: _widesub2: not found
./checkmany.sh: _widesub2: not found
./checkmany.sh: _widesub2: not found
./checkmany.sh: _widesub2: not found
gmake[2]: [Makefile:4676: widesub2] Error 1 (ignored)
widesub3
./checkmany.sh: -s}: not found
./checkmany.sh: _widesub3: not found
./checkmany.sh: _widesub3: not found
./checkmany.sh: _widesub3: not found
./checkmany.sh: _widesub3: not found
gmake[2]: [Makefile:4682: widesub3] Error 1 (ignored)
widesub4
./checkmany.sh: -s}: not found
./checkmany.sh: _widesub4: not found
./checkmany.sh: _widesub4: not found
./checkmany.sh: _widesub4: not found
./checkmany.sh: _widesub4: not found
gmake[2]: [Makefile:4688: widesub4] Error 1 (ignored)
wjposer1
./checkmany.sh: -s}: not found
./checkmany.sh: _wjposer1: not found
./checkmany.sh: _wjposer1: not found
gmake[2]: [Makefile:4694: wjposer1] Error 1 (ignored)
zero2
./checkmany.sh: -s}: not found
./checkmany.sh: _zero2: not found
./checkmany.sh: _zero2: not found
gmake[2]: [Makefile:4699: zero2] Error 1 (ignored)
zeroe0
./checkmany.sh: -s}: not found
./checkmany.sh: _zeroe0: not found
./checkmany.sh: _zeroe0: not found
gmake[2]: [Makefile:4704: zeroe0] Error 1 (ignored)
zeroflag
./checkmany.sh: -s}: not found
./checkmany.sh: _zeroflag: not found
./checkmany.sh: _zeroflag: not found
gmake[2]: [Makefile:4709: zeroflag] Error 1 (ignored)
======== Done with basic tests ========
======== Starting Unix tests ========
fflush
./checkmany.sh: -s}: not found
./checkmany.sh: _fflush: not found
./checkmany.sh: _fflush: not found
gmake[2]: [Makefile:4714: fflush] Error 1 (ignored)
getlnhd
./checkmany.sh: -s}: not found
./checkmany.sh: _getlnhd: not found
./checkmany.sh: _getlnhd: not found
gmake[2]: [Makefile:4719: getlnhd] Error 1 (ignored)
localenl
./checkmany.sh: -s}: not found
./checkmany.sh: _localenl: not found
./checkmany.sh: _localenl: not found
gmake[2]: [Makefile:4724: localenl] Error 1 (ignored)
pid
./checkmany.sh: -s}: not found
./checkmany.sh: _pid: not found
./checkmany.sh: _pid: not found
gmake[2]: [Makefile:2652: pid] Error 1 (ignored)
pipeio1
./checkmany.sh: -s}: not found
./checkmany.sh: _pipeio1: not found
./checkmany.sh: _pipeio1: not found
gmake[2]: [Makefile:2684: pipeio1] Error 1 (ignored)
pipeio2
./checkmany.sh: -s}: not found
./checkmany.sh: _pipeio2: not found
./checkmany.sh: _pipeio2: not found
gmake[2]: [Makefile:2689: pipeio2] Error 1 (ignored)
poundbang
rtlen
./checkmany.sh: -s}: not found
./checkmany.sh: _rtlen: not found
./checkmany.sh: _rtlen: not found
gmake[2]: [Makefile:4729: rtlen] Error 1 (ignored)
rtlen01
./checkmany.sh: -s}: not found
./checkmany.sh: _rtlen01: not found
./checkmany.sh: _rtlen01: not found
gmake[2]: [Makefile:4734: rtlen01] Error 1 (ignored)
space
./checkmany.sh: -s}: not found
./checkmany.sh: _space: not found
./checkmany.sh: _space: not found
./checkmany.sh: _space: not found
./checkmany.sh: _space: not found
gmake[2]: [Makefile:2730: space] Error 1 (ignored)
strftlng
./checkmany.sh: -s}: not found
./checkmany.sh: _strftlng: not found
./checkmany.sh: _strftlng: not found
gmake[2]: [Makefile:2658: strftlng] Error 1 (ignored)
======== Done with Unix tests ========
======== Starting gawk extension tests ========
aadelete1
./checkmany.sh: -s}: not found
./checkmany.sh: _aadelete1: not found
./checkmany.sh: _aadelete1: not found
gmake[2]: [Makefile:4739: aadelete1] Error 1 (ignored)
aadelete2
./checkmany.sh: -s}: not found
./checkmany.sh: _aadelete2: not found
./checkmany.sh: _aadelete2: not found
gmake[2]: [Makefile:4744: aadelete2] Error 1 (ignored)
aarray1
./checkmany.sh: -s}: not found
./checkmany.sh: _aarray1: not found
./checkmany.sh: _aarray1: not found
gmake[2]: [Makefile:4749: aarray1] Error 1 (ignored)
aasort
./checkmany.sh: -s}: not found
./checkmany.sh: _aasort: not found
./checkmany.sh: _aasort: not found
./checkmany.sh: _aasort: not found
./checkmany.sh: _aasort: not found
gmake[2]: [Makefile:4754: aasort] Error 1 (ignored)
aasorti
./checkmany.sh: -s}: not found
./checkmany.sh: _aasorti: not found
./checkmany.sh: _aasorti: not found
./checkmany.sh: _aasorti: not found
./checkmany.sh: _aasorti: not found
gmake[2]: [Makefile:4759: aasorti] Error 1 (ignored)
ar2fn_elnew_sc
./checkmany.sh: -s}: not found
./checkmany.sh: _ar2fn_elnew_sc: not found
./checkmany.sh: _ar2fn_elnew_sc: not found
gmake[2]: [Makefile:4764: ar2fn_elnew_sc] Error 1 (ignored)
ar2fn_elnew_sc2
./checkmany.sh: -s}: not found
./checkmany.sh: _ar2fn_elnew_sc2: not found
./checkmany.sh: _ar2fn_elnew_sc2: not found
gmake[2]: [Makefile:4769: ar2fn_elnew_sc2] Error 1 (ignored)
ar2fn_fmod
./checkmany.sh: -s}: not found
./checkmany.sh: _ar2fn_fmod: not found
./checkmany.sh: _ar2fn_fmod: not found
gmake[2]: [Makefile:4774: ar2fn_fmod] Error 1 (ignored)
ar2fn_unxptyp_aref
./checkmany.sh: -s}: not found
./checkmany.sh: _ar2fn_unxptyp_aref: not found
./checkmany.sh: _ar2fn_unxptyp_aref: not found
gmake[2]: [Makefile:4779: ar2fn_unxptyp_aref] Error 1 (ignored)
ar2fn_unxptyp_val
./checkmany.sh: -s}: not found
./checkmany.sh: _ar2fn_unxptyp_val: not found
./checkmany.sh: _ar2fn_unxptyp_val: not found
gmake[2]: [Makefile:4784: ar2fn_unxptyp_val] Error 1 (ignored)
argtest
./checkmany.sh: -s}: not found
./checkmany.sh: _argtest: not found
./checkmany.sh: _argtest: not found
gmake[2]: [Makefile:2616: argtest] Error 1 (ignored)
arraysort
./checkmany.sh: -s}: not found
./checkmany.sh: _arraysort: not found
./checkmany.sh: _arraysort: not found
./checkmany.sh: _arraysort: not found
./checkmany.sh: _arraysort: not found
gmake[2]: [Makefile:4789: arraysort] Error 1 (ignored)
arraysort2
./checkmany.sh: -s}: not found
./checkmany.sh: _arraysort2: not found
./checkmany.sh: _arraysort2: not found
gmake[2]: [Makefile:4794: arraysort2] Error 1 (ignored)
arraytype
./checkmany.sh: -s}: not found
./checkmany.sh: _arraytype: not found
./checkmany.sh: _arraytype: not found
./checkmany.sh: _arraytype: not found
./checkmany.sh: _arraytype: not found
gmake[2]: [Makefile:4799: arraytype] Error 1 (ignored)
asortbool
./checkmany.sh: -s}: not found
./checkmany.sh: _asortbool: not found
./checkmany.sh: _asortbool: not found
gmake[2]: [Makefile:4804: asortbool] Error 1 (ignored)
asortsymtab
./checkmany.sh: -s}: not found
./checkmany.sh: _asortsymtab: not found
./checkmany.sh: _asortsymtab: not found
./checkmany.sh: _asortsymtab: not found
./checkmany.sh: _asortsymtab: not found
gmake[2]: [Makefile:4809: asortsymtab] Error 1 (ignored)
backw
./checkmany.sh: -s}: not found
./checkmany.sh: _backw: not found
./checkmany.sh: _backw: not found
gmake[2]: [Makefile:4814: backw] Error 1 (ignored)
badargs
./checkmany.sh: -s}: not found
./checkmany.sh: _badargs: not found
./checkmany.sh: _badargs: not found
gmake[2]: [Makefile:2621: badargs] Error 1 (ignored)
beginfile1
./checkmany.sh: -s}: not found
./checkmany.sh: _beginfile1: not found
./checkmany.sh: _beginfile1: not found
./checkmany.sh: _beginfile1: not found
./checkmany.sh: _beginfile1: not found
gmake[2]: [Makefile:2807: beginfile1] Error 1 (ignored)
beginfile2
./checkmany.sh: -s}: not found
./checkmany.sh: _beginfile2: not found
./checkmany.sh: _beginfile2: not found
./checkmany.sh: _beginfile2: not found
./checkmany.sh: _beginfile2: not found
gmake[2]: [Makefile:2812: beginfile2] Error 1 (ignored)
binmode1
./checkmany.sh: -s}: not found
./checkmany.sh: _binmode1: not found
./checkmany.sh: _binmode1: not found
gmake[2]: [Makefile:2781: binmode1] Error 1 (ignored)
charasbytes
./checkmany.sh: -s}: not found
./checkmany.sh: _charasbytes: not found
./checkmany.sh: _charasbytes: not found
./checkmany.sh: _charasbytes: not found
./checkmany.sh: _charasbytes: not found
gmake[2]: [Makefile:3125: charasbytes] Error 1 (ignored)
clos1way
./checkmany.sh: -s}: not found
./checkmany.sh: _clos1way: not found
./checkmany.sh: _clos1way: not found
gmake[2]: [Makefile:4819: clos1way] Error 1 (ignored)
clos1way2
./checkmany.sh: -s}: not found
./checkmany.sh: _clos1way2: not found
./checkmany.sh: _clos1way2: not found
gmake[2]: [Makefile:4825: clos1way2] Error 1 (ignored)
clos1way3
./checkmany.sh: -s}: not found
./checkmany.sh: _clos1way3: not found
./checkmany.sh: _clos1way3: not found
gmake[2]: [Makefile:4830: clos1way3] Error 1 (ignored)
clos1way4
./checkmany.sh: -s}: not found
./checkmany.sh: _clos1way4: not found
./checkmany.sh: _clos1way4: not found
gmake[2]: [Makefile:4835: clos1way4] Error 1 (ignored)
clos1way5
./checkmany.sh: -s}: not found
./checkmany.sh: _clos1way5: not found
./checkmany.sh: _clos1way5: not found
gmake[2]: [Makefile:4840: clos1way5] Error 1 (ignored)
clos1way6
./checkmany.sh: -s}: not found
./checkmany.sh: _clos1way6: not found
./checkmany.sh: _clos1way6: not found
./checkmany.sh: _clos1way6: not found
./checkmany.sh: _clos1way6: not found
gmake[2]: [Makefile:4845: clos1way6] Error 1 (ignored)
colonwarn
./checkmany.sh: -s}: not found
./checkmany.sh: _colonwarn: not found
./checkmany.sh: _colonwarn: not found
gmake[2]: [Makefile:3154: colonwarn] Error 1 (ignored)
crlf
./checkmany.sh: -s}: not found
./checkmany.sh: _crlf: not found
./checkmany.sh: _crlf: not found
gmake[2]: [Makefile:4850: crlf] Error 1 (ignored)
csv1
./checkmany.sh: -s}: not found
./checkmany.sh: _csv1: not found
./checkmany.sh: _csv1: not found
gmake[2]: [Makefile:4855: csv1] Error 1 (ignored)
csv2
./checkmany.sh: -s}: not found
./checkmany.sh: _csv2: not found
./checkmany.sh: _csv2: not found
gmake[2]: [Makefile:4860: csv2] Error 1 (ignored)
csv3
./checkmany.sh: -s}: not found
./checkmany.sh: _csv3: not found
./checkmany.sh: _csv3: not found
gmake[2]: [Makefile:4865: csv3] Error 1 (ignored)
csvodd
./checkmany.sh: -s}: not found
./checkmany.sh: _csvodd: not found
./checkmany.sh: _csvodd: not found
gmake[2]: [Makefile:4870: csvodd] Error 1 (ignored)
dbugarray1
./checkmany.sh: -s}: not found
./checkmany.sh: _dbugarray1: not found
./checkmany.sh: _dbugarray1: not found
gmake[2]: [Makefile:4875: dbugarray1] Error 1 (ignored)
dbugarray2
./checkmany.sh: -s}: not found
./checkmany.sh: _dbugarray2: not found
./checkmany.sh: _dbugarray2: not found
gmake[2]: [Makefile:4880: dbugarray2] Error 1 (ignored)
dbugarray3
./checkmany.sh: -s}: not found
./checkmany.sh: _dbugarray3: not found
./checkmany.sh: _dbugarray3: not found
gmake[2]: [Makefile:4885: dbugarray3] Error 1 (ignored)
dbugarray4
./checkmany.sh: -s}: not found
./checkmany.sh: _dbugarray4: not found
./checkmany.sh: _dbugarray4: not found
./checkmany.sh: _dbugarray4: not found
./checkmany.sh: _dbugarray4: not found
gmake[2]: [Makefile:4890: dbugarray4] Error 1 (ignored)
dbugeval
dbugeval2
./checkmany.sh: -s}: not found
./checkmany.sh: _dbugeval2: not found
./checkmany.sh: _dbugeval2: not found
gmake[2]: [Makefile:4895: dbugeval2] Error 1 (ignored)
dbugeval3
./checkmany.sh: -s}: not found
./checkmany.sh: _dbugeval3: not found
./checkmany.sh: _dbugeval3: not found
gmake[2]: [Makefile:4900: dbugeval3] Error 1 (ignored)
dbugeval4
./checkmany.sh: -s}: not found
./checkmany.sh: _dbugeval4: not found
./checkmany.sh: _dbugeval4: not found
gmake[2]: [Makefile:4905: dbugeval4] Error 1 (ignored)
dbugtypedre1
./checkmany.sh: -s}: not found
./checkmany.sh: _dbugtypedre1: not found
./checkmany.sh: _dbugtypedre1: not found
gmake[2]: [Makefile:4910: dbugtypedre1] Error 1 (ignored)
dbugtypedre2
./checkmany.sh: -s}: not found
./checkmany.sh: _dbugtypedre2: not found
./checkmany.sh: _dbugtypedre2: not found
gmake[2]: [Makefile:4915: dbugtypedre2] Error 1 (ignored)
delmessy
./checkmany.sh: -s}: not found
./checkmany.sh: _delmessy: not found
./checkmany.sh: _delmessy: not found
gmake[2]: [Makefile:4920: delmessy] Error 1 (ignored)
delsub
./checkmany.sh: -s}: not found
./checkmany.sh: _delsub: not found
./checkmany.sh: _delsub: not found
gmake[2]: [Makefile:4925: delsub] Error 1 (ignored)
dbugbadcmd
./checkmany.sh: -s}: not found
./checkmany.sh: _dbugbadcmd: not found
./checkmany.sh: _dbugbadcmd: not found
./checkmany.sh: _dbugbadcmd: not found
./checkmany.sh: _dbugbadcmd: not found
gmake[2]: [Makefile:3270: dbugbadcmd] Error 1 (ignored)
dbugbreak
./checkmany.sh: -s}: not found
./checkmany.sh: _dbugbreak: not found
./checkmany.sh: _dbugbreak: not found
./checkmany.sh: _dbugbreak: not found
./checkmany.sh: _dbugbreak: not found
gmake[2]: [Makefile:3275: dbugbreak] Error 1 (ignored)
devfd
./checkmany.sh: -s}: not found
./checkmany.sh: _devfd: not found
./checkmany.sh: _devfd: not found
gmake[2]: [Makefile:2632: devfd] Error 1 (ignored)
devfd1
./checkmany.sh: -s}: not found
./checkmany.sh: _devfd1: not found
./checkmany.sh: _devfd1: not found
gmake[2]: [Makefile:2786: devfd1] Error 1 (ignored)
devfd2
./checkmany.sh: -s}: not found
./checkmany.sh: _devfd2: not found
./checkmany.sh: _devfd2: not found
gmake[2]: [Makefile:2792: devfd2] Error 1 (ignored)
dfacheck1
./checkmany.sh: -s}: not found
./checkmany.sh: _dfacheck1: not found
./checkmany.sh: _dfacheck1: not found
gmake[2]: [Makefile:4930: dfacheck1] Error 1 (ignored)
dumpvars
./checkmany.sh: -s}: not found
./checkmany.sh: _dumpvars: not found
./checkmany.sh: _dumpvars: not found
gmake[2]: [Makefile:2818: dumpvars] Error 1 (ignored)
elemnew1
./checkmany.sh: -s}: not found
./checkmany.sh: _elemnew1: not found
./checkmany.sh: _elemnew1: not found
gmake[2]: [Makefile:4935: elemnew1] Error 1 (ignored)
elemnew2
./checkmany.sh: -s}: not found
./checkmany.sh: _elemnew2: not found
./checkmany.sh: _elemnew2: not found
gmake[2]: [Makefile:4940: elemnew2] Error 1 (ignored)
elemnew3
./checkmany.sh: -s}: not found
./checkmany.sh: _elemnew3: not found
./checkmany.sh: _elemnew3: not found
gmake[2]: [Makefile:4945: elemnew3] Error 1 (ignored)
elemnew4
./checkmany.sh: -s}: not found
./checkmany.sh: _elemnew4: not found
./checkmany.sh: _elemnew4: not found
./checkmany.sh: _elemnew4: not found
./checkmany.sh: _elemnew4: not found
gmake[2]: [Makefile:4950: elemnew4] Error 1 (ignored)
equiv
./checkmany.sh: -s}: not found
./checkmany.sh: _equiv: not found
./checkmany.sh: _equiv: not found
gmake[2]: [Makefile:4955: equiv] Error 1 (ignored)
errno
./checkmany.sh: -s}: not found
./checkmany.sh: _errno: not found
./checkmany.sh: _errno: not found
./checkmany.sh: _errno: not found
./checkmany.sh: _errno: not found
gmake[2]: [Makefile:2639: errno] Error 1 (ignored)
exit
./checkmany.sh: -s}: not found
./checkmany.sh: _exit: not found
./checkmany.sh: _exit: not found
./checkmany.sh: _exit: not found
./checkmany.sh: _exit: not found
gmake[2]: [Makefile:4960: exit] Error 1 (ignored)
elemnew7
./checkmany.sh: -s}: not found
./checkmany.sh: _elemnew7: not found
./checkmany.sh: _elemnew7: not found
gmake[2]: [Makefile:4965: elemnew7] Error 1 (ignored)
fieldwdth
./checkmany.sh: -s}: not found
./checkmany.sh: _fieldwdth: not found
./checkmany.sh: _fieldwdth: not found
gmake[2]: [Makefile:4970: fieldwdth] Error 1 (ignored)
forcenum
./checkmany.sh: -s}: not found
./checkmany.sh: _forcenum: not found
./checkmany.sh: _forcenum: not found
./checkmany.sh: _forcenum: not found
./checkmany.sh: _forcenum: not found
gmake[2]: [Makefile:4975: forcenum] Error 1 (ignored)
fpat1
./checkmany.sh: -s}: not found
./checkmany.sh: _fpat1: not found
./checkmany.sh: _fpat1: not found
gmake[2]: [Makefile:4980: fpat1] Error 1 (ignored)
fpat2
./checkmany.sh: -s}: not found
./checkmany.sh: _fpat2: not found
./checkmany.sh: _fpat2: not found
gmake[2]: [Makefile:4985: fpat2] Error 1 (ignored)
fpat3
./checkmany.sh: -s}: not found
./checkmany.sh: _fpat3: not found
./checkmany.sh: _fpat3: not found
gmake[2]: [Makefile:4990: fpat3] Error 1 (ignored)
fpat4
./checkmany.sh: -s}: not found
./checkmany.sh: _fpat4: not found
./checkmany.sh: _fpat4: not found
gmake[2]: [Makefile:4995: fpat4] Error 1 (ignored)
fpat5
./checkmany.sh: -s}: not found
./checkmany.sh: _fpat5: not found
./checkmany.sh: _fpat5: not found
gmake[2]: [Makefile:5000: fpat5] Error 1 (ignored)
fpat6
./checkmany.sh: -s}: not found
./checkmany.sh: _fpat6: not found
./checkmany.sh: _fpat6: not found
gmake[2]: [Makefile:5005: fpat6] Error 1 (ignored)
fpat7
./checkmany.sh: -s}: not found
./checkmany.sh: _fpat7: not found
./checkmany.sh: _fpat7: not found
gmake[2]: [Makefile:5010: fpat7] Error 1 (ignored)
fpat8
./checkmany.sh: -s}: not found
./checkmany.sh: _fpat8: not found
./checkmany.sh: _fpat8: not found
gmake[2]: [Makefile:5015: fpat8] Error 1 (ignored)
fpat9
./checkmany.sh: -s}: not found
./checkmany.sh: _fpat9: not found
./checkmany.sh: _fpat9: not found
gmake[2]: [Makefile:5020: fpat9] Error 1 (ignored)
fpatnull
./checkmany.sh: -s}: not found
./checkmany.sh: _fpatnull: not found
./checkmany.sh: _fpatnull: not found
gmake[2]: [Makefile:5025: fpatnull] Error 1 (ignored)
fsfwfs
./checkmany.sh: -s}: not found
./checkmany.sh: _fsfwfs: not found
./checkmany.sh: _fsfwfs: not found
gmake[2]: [Makefile:5030: fsfwfs] Error 1 (ignored)
functab1
./checkmany.sh: -s}: not found
./checkmany.sh: _functab1: not found
./checkmany.sh: _functab1: not found
gmake[2]: [Makefile:5035: functab1] Error 1 (ignored)
functab2
./checkmany.sh: -s}: not found
./checkmany.sh: _functab2: not found
./checkmany.sh: _functab2: not found
gmake[2]: [Makefile:5040: functab2] Error 1 (ignored)
functab3
./checkmany.sh: -s}: not found
./checkmany.sh: _functab3: not found
./checkmany.sh: _functab3: not found
gmake[2]: [Makefile:5045: functab3] Error 1 (ignored)
functab6
./checkmany.sh: -s}: not found
./checkmany.sh: _functab6: not found
./checkmany.sh: _functab6: not found
gmake[2]: [Makefile:5050: functab6] Error 1 (ignored)
funlen
./checkmany.sh: -s}: not found
./checkmany.sh: _funlen: not found
./checkmany.sh: _funlen: not found
gmake[2]: [Makefile:5055: funlen] Error 1 (ignored)
fwtest
./checkmany.sh: -s}: not found
./checkmany.sh: _fwtest: not found
./checkmany.sh: _fwtest: not found
gmake[2]: [Makefile:5060: fwtest] Error 1 (ignored)
fwtest2
./checkmany.sh: -s}: not found
./checkmany.sh: _fwtest2: not found
./checkmany.sh: _fwtest2: not found
gmake[2]: [Makefile:5065: fwtest2] Error 1 (ignored)
fwtest3
./checkmany.sh: -s}: not found
./checkmany.sh: _fwtest3: not found
./checkmany.sh: _fwtest3: not found
gmake[2]: [Makefile:5070: fwtest3] Error 1 (ignored)
fwtest4
./checkmany.sh: -s}: not found
./checkmany.sh: _fwtest4: not found
./checkmany.sh: _fwtest4: not found
gmake[2]: [Makefile:5075: fwtest4] Error 1 (ignored)
fwtest5
./checkmany.sh: -s}: not found
./checkmany.sh: _fwtest5: not found
./checkmany.sh: _fwtest5: not found
gmake[2]: [Makefile:5080: fwtest5] Error 1 (ignored)
fwtest6
./checkmany.sh: -s}: not found
./checkmany.sh: _fwtest6: not found
./checkmany.sh: _fwtest6: not found
gmake[2]: [Makefile:5085: fwtest6] Error 1 (ignored)
fwtest7
./checkmany.sh: -s}: not found
./checkmany.sh: _fwtest7: not found
./checkmany.sh: _fwtest7: not found
gmake[2]: [Makefile:5090: fwtest7] Error 1 (ignored)
fwtest8
./checkmany.sh: -s}: not found
./checkmany.sh: _fwtest8: not found
./checkmany.sh: _fwtest8: not found
gmake[2]: [Makefile:5095: fwtest8] Error 1 (ignored)
genpot
./checkmany.sh: -s}: not found
./checkmany.sh: _genpot: not found
./checkmany.sh: _genpot: not found
gmake[2]: [Makefile:3173: genpot] Error 1 (ignored)
gensub
./checkmany.sh: -s}: not found
./checkmany.sh: _gensub: not found
./checkmany.sh: _gensub: not found
gmake[2]: [Makefile:5100: gensub] Error 1 (ignored)
gensub2
./checkmany.sh: -s}: not found
./checkmany.sh: _gensub2: not found
./checkmany.sh: _gensub2: not found
gmake[2]: [Makefile:5105: gensub2] Error 1 (ignored)
gensub3
./checkmany.sh: -s}: not found
./checkmany.sh: _gensub3: not found
./checkmany.sh: _gensub3: not found
gmake[2]: [Makefile:5110: gensub3] Error 1 (ignored)
gensub4
./checkmany.sh: -s}: not found
./checkmany.sh: _gensub4: not found
./checkmany.sh: _gensub4: not found
gmake[2]: [Makefile:5115: gensub4] Error 1 (ignored)
gensub5
./checkmany.sh: -s}: not found
./checkmany.sh: _gensub5: not found
./checkmany.sh: _gensub5: not found
gmake[2]: [Makefile:5120: gensub5] Error 1 (ignored)
getlndir
./checkmany.sh: -s}: not found
./checkmany.sh: _getlndir: not found
./checkmany.sh: _getlndir: not found
./checkmany.sh: _getlndir: not found
./checkmany.sh: _getlndir: not found
gmake[2]: [Makefile:5125: getlndir] Error 1 (ignored)
gnuops2
./checkmany.sh: -s}: not found
./checkmany.sh: _gnuops2: not found
./checkmany.sh: _gnuops2: not found
gmake[2]: [Makefile:5130: gnuops2] Error 1 (ignored)
gnuops3
./checkmany.sh: -s}: not found
./checkmany.sh: _gnuops3: not found
./checkmany.sh: _gnuops3: not found
gmake[2]: [Makefile:5135: gnuops3] Error 1 (ignored)
gnureops
./checkmany.sh: -s}: not found
./checkmany.sh: _gnureops: not found
./checkmany.sh: _gnureops: not found
gmake[2]: [Makefile:5140: gnureops] Error 1 (ignored)
gsubind
./checkmany.sh: -s}: not found
./checkmany.sh: _gsubind: not found
./checkmany.sh: _gsubind: not found
gmake[2]: [Makefile:5145: gsubind] Error 1 (ignored)
hexfloat
./checkmany.sh: -s}: not found
./checkmany.sh: _hexfloat: not found
./checkmany.sh: _hexfloat: not found
./checkmany.sh: _hexfloat: not found
./checkmany.sh: _hexfloat: not found
gmake[2]: [Makefile:5150: hexfloat] Error 1 (ignored)
icasefs
./checkmany.sh: -s}: not found
./checkmany.sh: _icasefs: not found
./checkmany.sh: _icasefs: not found
gmake[2]: [Makefile:5155: icasefs] Error 1 (ignored)
icasers
./checkmany.sh: -s}: not found
./checkmany.sh: _icasers: not found
./checkmany.sh: _icasers: not found
gmake[2]: [Makefile:5160: icasers] Error 1 (ignored)
id
./checkmany.sh: -s}: not found
./checkmany.sh: _id: not found
./checkmany.sh: _id: not found
gmake[2]: [Makefile:5165: id] Error 1 (ignored)
igncdym
./checkmany.sh: -s}: not found
./checkmany.sh: _igncdym: not found
./checkmany.sh: _igncdym: not found
gmake[2]: [Makefile:5170: igncdym] Error 1 (ignored)
igncfs
./checkmany.sh: -s}: not found
./checkmany.sh: _igncfs: not found
./checkmany.sh: _igncfs: not found
gmake[2]: [Makefile:5175: igncfs] Error 1 (ignored)
ignrcas2
./checkmany.sh: -s}: not found
./checkmany.sh: _ignrcas2: not found
./checkmany.sh: _ignrcas2: not found
./checkmany.sh: _ignrcas2: not found
./checkmany.sh: _ignrcas2: not found
gmake[2]: [Makefile:5180: ignrcas2] Error 1 (ignored)
ignrcas4
./checkmany.sh: -s}: not found
./checkmany.sh: _ignrcas4: not found
./checkmany.sh: _ignrcas4: not found
gmake[2]: [Makefile:5186: ignrcas4] Error 1 (ignored)
ignrcase
./checkmany.sh: -s}: not found
./checkmany.sh: _ignrcase: not found
./checkmany.sh: _ignrcase: not found
gmake[2]: [Makefile:5191: ignrcase] Error 1 (ignored)
incdupe
./checkmany.sh: -s}: not found
./checkmany.sh: _incdupe: not found
./checkmany.sh: _incdupe: not found
gmake[2]: [Makefile:2968: incdupe] Error 1 (ignored)
incdupe2
./checkmany.sh: -s}: not found
./checkmany.sh: _incdupe2: not found
./checkmany.sh: _incdupe2: not found
gmake[2]: [Makefile:2973: incdupe2] Error 1 (ignored)
incdupe3
./checkmany.sh: -s}: not found
./checkmany.sh: _incdupe3: not found
./checkmany.sh: _incdupe3: not found
gmake[2]: [Makefile:2978: incdupe3] Error 1 (ignored)
incdupe4
./checkmany.sh: -s}: not found
./checkmany.sh: _incdupe4: not found
./checkmany.sh: _incdupe4: not found
gmake[2]: [Makefile:2983: incdupe4] Error 1 (ignored)
incdupe5
./checkmany.sh: -s}: not found
./checkmany.sh: _incdupe5: not found
./checkmany.sh: _incdupe5: not found
gmake[2]: [Makefile:2988: incdupe5] Error 1 (ignored)
incdupe6
./checkmany.sh: -s}: not found
./checkmany.sh: _incdupe6: not found
./checkmany.sh: _incdupe6: not found
gmake[2]: [Makefile:2993: incdupe6] Error 1 (ignored)
incdupe7
./checkmany.sh: -s}: not found
./checkmany.sh: _incdupe7: not found
./checkmany.sh: _incdupe7: not found
gmake[2]: [Makefile:2998: incdupe7] Error 1 (ignored)
include
./checkmany.sh: -s}: not found
./checkmany.sh: _include: not found
./checkmany.sh: _include: not found
gmake[2]: [Makefile:5196: include] Error 1 (ignored)
include2
./checkmany.sh: -s}: not found
./checkmany.sh: _include2: not found
./checkmany.sh: _include2: not found
gmake[2]: [Makefile:2963: include2] Error 1 (ignored)
indirectbuiltin
./checkmany.sh: -s}: not found
./checkmany.sh: _indirectbuiltin: not found
./checkmany.sh: _indirectbuiltin: not found
gmake[2]: [Makefile:5201: indirectbuiltin] Error 1 (ignored)
indirectbuiltin3
./checkmany.sh: -s}: not found
./checkmany.sh: _indirectbuiltin3: not found
./checkmany.sh: _indirectbuiltin3: not found
gmake[2]: [Makefile:5206: indirectbuiltin3] Error 1 (ignored)
indirectbuiltin4
./checkmany.sh: -s}: not found
./checkmany.sh: _indirectbuiltin4: not found
./checkmany.sh: _indirectbuiltin4: not found
gmake[2]: [Makefile:5211: indirectbuiltin4] Error 1 (ignored)
indirectbuiltin5
./checkmany.sh: -s}: not found
./checkmany.sh: _indirectbuiltin5: not found
./checkmany.sh: _indirectbuiltin5: not found
gmake[2]: [Makefile:5216: indirectbuiltin5] Error 1 (ignored)
indirectbuiltin6
./checkmany.sh: -s}: not found
./checkmany.sh: _indirectbuiltin6: not found
./checkmany.sh: _indirectbuiltin6: not found
gmake[2]: [Makefile:5221: indirectbuiltin6] Error 1 (ignored)
indirectcall
./checkmany.sh: -s}: not found
./checkmany.sh: _indirectcall: not found
./checkmany.sh: _indirectcall: not found
gmake[2]: [Makefile:5226: indirectcall] Error 1 (ignored)
indirectcall2
./checkmany.sh: -s}: not found
./checkmany.sh: _indirectcall2: not found
./checkmany.sh: _indirectcall2: not found
gmake[2]: [Makefile:5231: indirectcall2] Error 1 (ignored)
indirectbuiltin7
./checkmany.sh: -s}: not found
./checkmany.sh: _indirectbuiltin7: not found
./checkmany.sh: _indirectbuiltin7: not found
gmake[2]: [Makefile:5236: indirectbuiltin7] Error 1 (ignored)
indirectbuiltin8
./checkmany.sh: -s}: not found
./checkmany.sh: _indirectbuiltin8: not found
./checkmany.sh: _indirectbuiltin8: not found
gmake[2]: [Makefile:5241: indirectbuiltin8] Error 1 (ignored)
indirectbuiltin9
./checkmany.sh: -s}: not found
./checkmany.sh: _indirectbuiltin9: not found
./checkmany.sh: _indirectbuiltin9: not found
gmake[2]: [Makefile:5246: indirectbuiltin9] Error 1 (ignored)
indirectcall3
./checkmany.sh: -s}: not found
./checkmany.sh: _indirectcall3: not found
./checkmany.sh: _indirectcall3: not found
gmake[2]: [Makefile:5251: indirectcall3] Error 1 (ignored)
intarray
./checkmany.sh: -s}: not found
./checkmany.sh: _intarray: not found
./checkmany.sh: _intarray: not found
gmake[2]: [Makefile:5256: intarray] Error 1 (ignored)
iolint
./checkmany.sh: -s}: not found
./checkmany.sh: _iolint: not found
./checkmany.sh: _iolint: not found
./checkmany.sh: _iolint: not found
./checkmany.sh: _iolint: not found
gmake[2]: [Makefile:3246: iolint] Error 1 (ignored)
isarrayunset
./checkmany.sh: -s}: not found
./checkmany.sh: _isarrayunset: not found
./checkmany.sh: _isarrayunset: not found
gmake[2]: [Makefile:5261: isarrayunset] Error 1 (ignored)
lint
./checkmany.sh: -s}: not found
./checkmany.sh: _lint: not found
./checkmany.sh: _lint: not found
gmake[2]: [Makefile:5266: lint] Error 1 (ignored)
lintexp
./checkmany.sh: -s}: not found
./checkmany.sh: _lintexp: not found
./checkmany.sh: _lintexp: not found
gmake[2]: [Makefile:5271: lintexp] Error 1 (ignored)
lintindex
./checkmany.sh: -s}: not found
./checkmany.sh: _lintindex: not found
./checkmany.sh: _lintindex: not found
gmake[2]: [Makefile:5276: lintindex] Error 1 (ignored)
lintint
./checkmany.sh: -s}: not found
./checkmany.sh: _lintint: not found
./checkmany.sh: _lintint: not found
gmake[2]: [Makefile:5281: lintint] Error 1 (ignored)
lintlength
./checkmany.sh: -s}: not found
./checkmany.sh: _lintlength: not found
./checkmany.sh: _lintlength: not found
gmake[2]: [Makefile:5286: lintlength] Error 1 (ignored)
lintplus
./checkmany.sh: -s}: not found
./checkmany.sh: _lintplus: not found
./checkmany.sh: _lintplus: not found
gmake[2]: [Makefile:5291: lintplus] Error 1 (ignored)
lintplus2
./checkmany.sh: -s}: not found
./checkmany.sh: _lintplus2: not found
./checkmany.sh: _lintplus2: not found
gmake[2]: [Makefile:5296: lintplus2] Error 1 (ignored)
lintplus3
./checkmany.sh: -s}: not found
./checkmany.sh: _lintplus3: not found
./checkmany.sh: _lintplus3: not found
gmake[2]: [Makefile:5301: lintplus3] Error 1 (ignored)
lintset
./checkmany.sh: -s}: not found
./checkmany.sh: _lintset: not found
./checkmany.sh: _lintset: not found
gmake[2]: [Makefile:5306: lintset] Error 1 (ignored)
lintsubarray
./checkmany.sh: -s}: not found
./checkmany.sh: _lintsubarray: not found
./checkmany.sh: _lintsubarray: not found
gmake[2]: [Makefile:5311: lintsubarray] Error 1 (ignored)
linttypeof
./checkmany.sh: -s}: not found
./checkmany.sh: _linttypeof: not found
./checkmany.sh: _linttypeof: not found
gmake[2]: [Makefile:5316: linttypeof] Error 1 (ignored)
lintwarn
./checkmany.sh: -s}: not found
./checkmany.sh: _lintwarn: not found
./checkmany.sh: _lintwarn: not found
gmake[2]: [Makefile:5321: lintwarn] Error 1 (ignored)
manyfiles
./checkmany.sh: -s}: not found
./checkmany.sh: _manyfiles: not found
./checkmany.sh: _manyfiles: not found
gmake[2]: [Makefile:2585: manyfiles] Error 1 (ignored)
match1
./checkmany.sh: -s}: not found
./checkmany.sh: _match1: not found
./checkmany.sh: _match1: not found
gmake[2]: [Makefile:5326: match1] Error 1 (ignored)
match2
./checkmany.sh: -s}: not found
./checkmany.sh: _match2: not found
./checkmany.sh: _match2: not found
gmake[2]: [Makefile:5331: match2] Error 1 (ignored)
match3
./checkmany.sh: -s}: not found
./checkmany.sh: _match3: not found
./checkmany.sh: _match3: not found
gmake[2]: [Makefile:5336: match3] Error 1 (ignored)
mdim1
./checkmany.sh: -s}: not found
./checkmany.sh: _mdim1: not found
./checkmany.sh: _mdim1: not found
gmake[2]: [Makefile:5341: mdim1] Error 1 (ignored)
mdim2
./checkmany.sh: -s}: not found
./checkmany.sh: _mdim2: not found
./checkmany.sh: _mdim2: not found
gmake[2]: [Makefile:5346: mdim2] Error 1 (ignored)
mdim3
./checkmany.sh: -s}: not found
./checkmany.sh: _mdim3: not found
./checkmany.sh: _mdim3: not found
gmake[2]: [Makefile:5351: mdim3] Error 1 (ignored)
mdim4
./checkmany.sh: -s}: not found
./checkmany.sh: _mdim4: not found
./checkmany.sh: _mdim4: not found
gmake[2]: [Makefile:5356: mdim4] Error 1 (ignored)
mdim5
./checkmany.sh: -s}: not found
./checkmany.sh: _mdim5: not found
./checkmany.sh: _mdim5: not found
gmake[2]: [Makefile:5361: mdim5] Error 1 (ignored)
mdim6
./checkmany.sh: -s}: not found
./checkmany.sh: _mdim6: not found
./checkmany.sh: _mdim6: not found
gmake[2]: [Makefile:5366: mdim6] Error 1 (ignored)
mdim7
./checkmany.sh: -s}: not found
./checkmany.sh: _mdim7: not found
./checkmany.sh: _mdim7: not found
gmake[2]: [Makefile:5371: mdim7] Error 1 (ignored)
mdim8
./checkmany.sh: -s}: not found
./checkmany.sh: _mdim8: not found
./checkmany.sh: _mdim8: not found
gmake[2]: [Makefile:5376: mdim8] Error 1 (ignored)
mdim9
./checkmany.sh: -s}: not found
./checkmany.sh: _mdim9: not found
./checkmany.sh: _mdim9: not found
gmake[2]: [Makefile:5381: mdim9] Error 1 (ignored)
memleak2
./checkmany.sh: -s}: not found
./checkmany.sh: _memleak2: not found
./checkmany.sh: _memleak2: not found
gmake[2]: [Makefile:5386: memleak2] Error 1 (ignored)
memleak3
./checkmany.sh: -s}: not found
./checkmany.sh: _memleak3: not found
./checkmany.sh: _memleak3: not found
gmake[2]: [Makefile:5391: memleak3] Error 1 (ignored)
mixed1
./checkmany.sh: -s}: not found
./checkmany.sh: _mixed1: not found
./checkmany.sh: _mixed1: not found
gmake[2]: [Makefile:2797: mixed1] Error 1 (ignored)
mktime
./checkmany.sh: -s}: not found
./checkmany.sh: _mktime: not found
./checkmany.sh: _mktime: not found
gmake[2]: [Makefile:5396: mktime] Error 1 (ignored)
modifiers
./checkmany.sh: -s}: not found
./checkmany.sh: _modifiers: not found
./checkmany.sh: _modifiers: not found
gmake[2]: [Makefile:5401: modifiers] Error 1 (ignored)
muldimposix
./checkmany.sh: -s}: not found
./checkmany.sh: _muldimposix: not found
./checkmany.sh: _muldimposix: not found
gmake[2]: [Makefile:5406: muldimposix] Error 1 (ignored)
nastyparm
./checkmany.sh: -s}: not found
./checkmany.sh: _nastyparm: not found
./checkmany.sh: _nastyparm: not found
gmake[2]: [Makefile:5411: nastyparm] Error 1 (ignored)
negtime
next
./checkmany.sh: -s}: not found
./checkmany.sh: _next: not found
./checkmany.sh: _next: not found
gmake[2]: [Makefile:5416: next] Error 1 (ignored)
nondec
./checkmany.sh: -s}: not found
./checkmany.sh: _nondec: not found
./checkmany.sh: _nondec: not found
gmake[2]: [Makefile:5421: nondec] Error 1 (ignored)
nondec2
./checkmany.sh: -s}: not found
./checkmany.sh: _nondec2: not found
./checkmany.sh: _nondec2: not found
gmake[2]: [Makefile:5426: nondec2] Error 1 (ignored)
nonfatal1
./checkmany.sh: -s}: not found
./checkmany.sh: _nonfatal1: not found
./checkmany.sh: _nonfatal1: not found
gmake[2]: [Makefile:3220: nonfatal1] Error 1 (ignored)
nonfatal2
./checkmany.sh: -s}: not found
./checkmany.sh: _nonfatal2: not found
./checkmany.sh: _nonfatal2: not found
./checkmany.sh: _nonfatal2: not found
./checkmany.sh: _nonfatal2: not found
gmake[2]: [Makefile:5431: nonfatal2] Error 1 (ignored)
nonfatal3
./checkmany.sh: -s}: not found
./checkmany.sh: _nonfatal3: not found
./checkmany.sh: _nonfatal3: not found
gmake[2]: [Makefile:5436: nonfatal3] Error 1 (ignored)
nsawk1a
./checkmany.sh: -s}: not found
./checkmany.sh: _nsawk1a: not found
./checkmany.sh: _nsawk1a: not found
gmake[2]: [Makefile:2938: nsawk1a] Error 1 (ignored)
nsawk1b
./checkmany.sh: -s}: not found
./checkmany.sh: _nsawk1b: not found
./checkmany.sh: _nsawk1b: not found
gmake[2]: [Makefile:2943: nsawk1b] Error 1 (ignored)
nsawk1c
./checkmany.sh: -s}: not found
./checkmany.sh: _nsawk1c: not found
./checkmany.sh: _nsawk1c: not found
gmake[2]: [Makefile:2948: nsawk1c] Error 1 (ignored)
nsawk2a
./checkmany.sh: -s}: not found
./checkmany.sh: _nsawk2a: not found
./checkmany.sh: _nsawk2a: not found
gmake[2]: [Makefile:2953: nsawk2a] Error 1 (ignored)
nsawk2b
./checkmany.sh: -s}: not found
./checkmany.sh: _nsawk2b: not found
./checkmany.sh: _nsawk2b: not found
gmake[2]: [Makefile:2958: nsawk2b] Error 1 (ignored)
nsbad
./checkmany.sh: -s}: not found
./checkmany.sh: _nsbad: not found
./checkmany.sh: _nsbad: not found
gmake[2]: [Makefile:5441: nsbad] Error 1 (ignored)
nsbad2
./checkmany.sh: -s}: not found
./checkmany.sh: _nsbad2: not found
./checkmany.sh: _nsbad2: not found
gmake[2]: [Makefile:5446: nsbad2] Error 1 (ignored)
nsbad3
./checkmany.sh: -s}: not found
./checkmany.sh: _nsbad3: not found
./checkmany.sh: _nsbad3: not found
gmake[2]: [Makefile:5451: nsbad3] Error 1 (ignored)
nsbad_cmd
./checkmany.sh: -s}: not found
./checkmany.sh: _nsbad_cmd: not found
./checkmany.sh: _nsbad_cmd: not found
gmake[2]: [Makefile:3214: nsbad_cmd] Error 1 (ignored)
nsforloop
./checkmany.sh: -s}: not found
./checkmany.sh: _nsforloop: not found
./checkmany.sh: _nsforloop: not found
gmake[2]: [Makefile:5456: nsforloop] Error 1 (ignored)
nsfuncrecurse
./checkmany.sh: -s}: not found
./checkmany.sh: _nsfuncrecurse: not found
./checkmany.sh: _nsfuncrecurse: not found
gmake[2]: [Makefile:5461: nsfuncrecurse] Error 1 (ignored)
nsidentifier
./checkmany.sh: -s}: not found
./checkmany.sh: _nsidentifier: not found
./checkmany.sh: _nsidentifier: not found
gmake[2]: [Makefile:3230: nsidentifier] Error 1 (ignored)
nsindirect1
./checkmany.sh: -s}: not found
./checkmany.sh: _nsindirect1: not found
./checkmany.sh: _nsindirect1: not found
gmake[2]: [Makefile:5466: nsindirect1] Error 1 (ignored)
nsindirect2
./checkmany.sh: -s}: not found
./checkmany.sh: _nsindirect2: not found
./checkmany.sh: _nsindirect2: not found
gmake[2]: [Makefile:5471: nsindirect2] Error 1 (ignored)
nsprof1
./checkmany.sh: -s}: not found
./checkmany.sh: _nsprof1: not found
./checkmany.sh: _nsprof1: not found
gmake[2]: [Makefile:5476: nsprof1] Error 1 (ignored)
nsprof2
./checkmany.sh: -s}: not found
./checkmany.sh: _nsprof2: not found
./checkmany.sh: _nsprof2: not found
gmake[2]: [Makefile:5481: nsprof2] Error 1 (ignored)
nsprof3
./checkmany.sh: -s}: not found
./checkmany.sh: _nsprof3: not found
./checkmany.sh: _nsprof3: not found
gmake[2]: [Makefile:5486: nsprof3] Error 1 (ignored)
octdec
./checkmany.sh: -s}: not found
./checkmany.sh: _octdec: not found
./checkmany.sh: _octdec: not found
gmake[2]: [Makefile:5491: octdec] Error 1 (ignored)
patsplit
./checkmany.sh: -s}: not found
./checkmany.sh: _patsplit: not found
./checkmany.sh: _patsplit: not found
gmake[2]: [Makefile:5496: patsplit] Error 1 (ignored)
posix
./checkmany.sh: -s}: not found
./checkmany.sh: _posix: not found
./checkmany.sh: _posix: not found
gmake[2]: [Makefile:5501: posix] Error 1 (ignored)
printfbad1
./checkmany.sh: -s}: not found
./checkmany.sh: _printfbad1: not found
./checkmany.sh: _printfbad1: not found
gmake[2]: [Makefile:5506: printfbad1] Error 1 (ignored)
printfbad2
./checkmany.sh: -s}: not found
./checkmany.sh: _printfbad2: not found
./checkmany.sh: _printfbad2: not found
gmake[2]: [Makefile:2802: printfbad2] Error 1 (ignored)
printfbad3
./checkmany.sh: -s}: not found
./checkmany.sh: _printfbad3: not found
./checkmany.sh: _printfbad3: not found
gmake[2]: [Makefile:5511: printfbad3] Error 1 (ignored)
printfbad4
./checkmany.sh: -s}: not found
./checkmany.sh: _printfbad4: not found
./checkmany.sh: _printfbad4: not found
gmake[2]: [Makefile:5516: printfbad4] Error 1 (ignored)
printhuge
./checkmany.sh: -s}: not found
./checkmany.sh: _printhuge: not found
./checkmany.sh: _printhuge: not found
./checkmany.sh: _printhuge: not found
./checkmany.sh: _printhuge: not found
gmake[2]: [Makefile:5521: printhuge] Error 1 (ignored)
procinfs
./checkmany.sh: -s}: not found
./checkmany.sh: _procinfs: not found
./checkmany.sh: _procinfs: not found
gmake[2]: [Makefile:5527: procinfs] Error 1 (ignored)
profile0
./checkmany.sh: -s}: not found
./checkmany.sh: _profile0: not found
./checkmany.sh: _profile0: not found
gmake[2]: [Makefile:2824: profile0] Error 1 (ignored)
profile1
profile2
./checkmany.sh: -s}: not found
./checkmany.sh: _profile2: not found
./checkmany.sh: _profile2: not found
gmake[2]: [Makefile:2838: profile2] Error 1 (ignored)
profile3
./checkmany.sh: -s}: not found
./checkmany.sh: _profile3: not found
./checkmany.sh: _profile3: not found
gmake[2]: [Makefile:2844: profile3] Error 1 (ignored)
profile4
./checkmany.sh: -s}: not found
./checkmany.sh: _profile4: not found
./checkmany.sh: _profile4: not found
gmake[2]: [Makefile:5532: profile4] Error 1 (ignored)
profile5
./checkmany.sh: -s}: not found
./checkmany.sh: _profile5: not found
./checkmany.sh: _profile5: not found
./checkmany.sh: _profile5: not found
./checkmany.sh: _profile5: not found
gmake[2]: [Makefile:2850: profile5] Error 1 (ignored)
profile6
./checkmany.sh: -s}: not found
./checkmany.sh: _profile6: not found
./checkmany.sh: _profile6: not found
gmake[2]: [Makefile:2856: profile6] Error 1 (ignored)
profile7
./checkmany.sh: -s}: not found
./checkmany.sh: _profile7: not found
./checkmany.sh: _profile7: not found
gmake[2]: [Makefile:2862: profile7] Error 1 (ignored)
profile8
./checkmany.sh: -s}: not found
./checkmany.sh: _profile8: not found
./checkmany.sh: _profile8: not found
gmake[2]: [Makefile:5537: profile8] Error 1 (ignored)
profile9
./checkmany.sh: -s}: not found
./checkmany.sh: _profile9: not found
./checkmany.sh: _profile9: not found
gmake[2]: [Makefile:5542: profile9] Error 1 (ignored)
profile10
./checkmany.sh: -s}: not found
./checkmany.sh: _profile10: not found
./checkmany.sh: _profile10: not found
gmake[2]: [Makefile:5547: profile10] Error 1 (ignored)
profile11
./checkmany.sh: -s}: not found
./checkmany.sh: _profile11: not found
./checkmany.sh: _profile11: not found
gmake[2]: [Makefile:5552: profile11] Error 1 (ignored)
profile12
./checkmany.sh: -s}: not found
./checkmany.sh: _profile12: not found
./checkmany.sh: _profile12: not found
gmake[2]: [Makefile:2868: profile12] Error 1 (ignored)
profile13
./checkmany.sh: -s}: not found
./checkmany.sh: _profile13: not found
./checkmany.sh: _profile13: not found
gmake[2]: [Makefile:5557: profile13] Error 1 (ignored)
profile14
./checkmany.sh: -s}: not found
./checkmany.sh: _profile14: not found
./checkmany.sh: _profile14: not found
gmake[2]: [Makefile:5562: profile14] Error 1 (ignored)
profile15
./checkmany.sh: -s}: not found
./checkmany.sh: _profile15: not found
./checkmany.sh: _profile15: not found
gmake[2]: [Makefile:5567: profile15] Error 1 (ignored)
profile16
./checkmany.sh: -s}: not found
./checkmany.sh: _profile16: not found
./checkmany.sh: _profile16: not found
gmake[2]: [Makefile:5572: profile16] Error 1 (ignored)
profile17
./checkmany.sh: -s}: not found
./checkmany.sh: _profile17: not found
./checkmany.sh: _profile17: not found
gmake[2]: [Makefile:5577: profile17] Error 1 (ignored)
pty1
./checkmany.sh: -s}: not found
./checkmany.sh: _pty1: not found
./checkmany.sh: _pty1: not found
gmake[2]: [Makefile:3187: pty1] Error 1 (ignored)
pty2
./checkmany.sh: -s}: not found
./checkmany.sh: _pty2: not found
./checkmany.sh: _pty2: not found
gmake[2]: [Makefile:3195: pty2] Error 1 (ignored)
re_test
./checkmany.sh: -s}: not found
./checkmany.sh: _re_test: not found
./checkmany.sh: _re_test: not found
gmake[2]: [Makefile:5582: re_test] Error 1 (ignored)
rebuf
./checkmany.sh: -s}: not found
./checkmany.sh: _rebuf: not found
./checkmany.sh: _rebuf: not found
gmake[2]: [Makefile:2673: rebuf] Error 1 (ignored)
regexsub
./checkmany.sh: -s}: not found
./checkmany.sh: _regexsub: not found
./checkmany.sh: _regexsub: not found
gmake[2]: [Makefile:5587: regexsub] Error 1 (ignored)
reginttrad
./checkmany.sh: -s}: not found
./checkmany.sh: _reginttrad: not found
./checkmany.sh: _reginttrad: not found
gmake[2]: [Makefile:3149: reginttrad] Error 1 (ignored)
regnul1
./checkmany.sh: -s}: not found
./checkmany.sh: _regnul1: not found
./checkmany.sh: _regnul1: not found
gmake[2]: [Makefile:5592: regnul1] Error 1 (ignored)
regnul2
./checkmany.sh: -s}: not found
./checkmany.sh: _regnul2: not found
./checkmany.sh: _regnul2: not found
gmake[2]: [Makefile:5597: regnul2] Error 1 (ignored)
regx8bit
./checkmany.sh: -s}: not found
./checkmany.sh: _regx8bit: not found
./checkmany.sh: _regx8bit: not found
gmake[2]: [Makefile:5602: regx8bit] Error 1 (ignored)
reint
./checkmany.sh: -s}: not found
./checkmany.sh: _reint: not found
./checkmany.sh: _reint: not found
gmake[2]: [Makefile:5607: reint] Error 1 (ignored)
reint2
./checkmany.sh: -s}: not found
./checkmany.sh: _reint2: not found
./checkmany.sh: _reint2: not found
./checkmany.sh: _reint2: not found
./checkmany.sh: _reint2: not found
gmake[2]: [Makefile:5612: reint2] Error 1 (ignored)
rsgetline
./checkmany.sh: -s}: not found
./checkmany.sh: _rsgetline: not found
./checkmany.sh: _rsgetline: not found
gmake[2]: [Makefile:5618: rsgetline] Error 1 (ignored)
rsglstdin
./checkmany.sh: -s}: not found
./checkmany.sh: _rsglstdin: not found
./checkmany.sh: _rsglstdin: not found
gmake[2]: [Makefile:2678: rsglstdin] Error 1 (ignored)
rsstart1
./checkmany.sh: -s}: not found
./checkmany.sh: _rsstart1: not found
./checkmany.sh: _rsstart1: not found
gmake[2]: [Makefile:5623: rsstart1] Error 1 (ignored)
rsstart2
./checkmany.sh: -s}: not found
./checkmany.sh: _rsstart2: not found
./checkmany.sh: _rsstart2: not found
gmake[2]: [Makefile:5628: rsstart2] Error 1 (ignored)
rsstart3
./checkmany.sh: -s}: not found
./checkmany.sh: _rsstart3: not found
./checkmany.sh: _rsstart3: not found
gmake[2]: [Makefile:2763: rsstart3] Error 1 (ignored)
rstest6
./checkmany.sh: -s}: not found
./checkmany.sh: _rstest6: not found
./checkmany.sh: _rstest6: not found
gmake[2]: [Makefile:5633: rstest6] Error 1 (ignored)
sandbox1
./checkmany.sh: -s}: not found
./checkmany.sh: _sandbox1: not found
./checkmany.sh: _sandbox1: not found
gmake[2]: [Makefile:5638: sandbox1] Error 1 (ignored)
shadow
./checkmany.sh: -s}: not found
./checkmany.sh: _shadow: not found
./checkmany.sh: _shadow: not found
gmake[2]: [Makefile:5643: shadow] Error 1 (ignored)
shadowbuiltin
./checkmany.sh: -s}: not found
./checkmany.sh: _shadowbuiltin: not found
./checkmany.sh: _shadowbuiltin: not found
gmake[2]: [Makefile:5648: shadowbuiltin] Error 1 (ignored)
sortfor
./checkmany.sh: -s}: not found
./checkmany.sh: _sortfor: not found
./checkmany.sh: _sortfor: not found
./checkmany.sh: _sortfor: not found
./checkmany.sh: _sortfor: not found
gmake[2]: [Makefile:5653: sortfor] Error 1 (ignored)
sortfor2
./checkmany.sh: -s}: not found
./checkmany.sh: _sortfor2: not found
./checkmany.sh: _sortfor2: not found
gmake[2]: [Makefile:5658: sortfor2] Error 1 (ignored)
sortu
./checkmany.sh: -s}: not found
./checkmany.sh: _sortu: not found
./checkmany.sh: _sortu: not found
./checkmany.sh: _sortu: not found
./checkmany.sh: _sortu: not found
gmake[2]: [Makefile:5663: sortu] Error 1 (ignored)
sourcesplit
./checkmany.sh: -s}: not found
./checkmany.sh: _sourcesplit: not found
./checkmany.sh: _sourcesplit: not found
gmake[2]: [Makefile:3204: sourcesplit] Error 1 (ignored)
split_after_fpat
./checkmany.sh: -s}: not found
./checkmany.sh: _split_after_fpat: not found
./checkmany.sh: _split_after_fpat: not found
gmake[2]: [Makefile:5668: split_after_fpat] Error 1 (ignored)
splitarg4
./checkmany.sh: -s}: not found
./checkmany.sh: _splitarg4: not found
./checkmany.sh: _splitarg4: not found
gmake[2]: [Makefile:5673: splitarg4] Error 1 (ignored)
strftfld
./checkmany.sh: -s}: not found
./checkmany.sh: _strftfld: not found
./checkmany.sh: _strftfld: not found
gmake[2]: [Makefile:5678: strftfld] Error 1 (ignored)
strftime
./checkmany.sh: -s}: not found
./checkmany.sh: _strftime: not found
./checkmany.sh: _strftime: not found
gmake[2]: [Makefile:2626: strftime] Error 1 (ignored)
strtonum
./checkmany.sh: -s}: not found
./checkmany.sh: _strtonum: not found
./checkmany.sh: _strtonum: not found
gmake[2]: [Makefile:5683: strtonum] Error 1 (ignored)
strtonum1
./checkmany.sh: -s}: not found
./checkmany.sh: _strtonum1: not found
./checkmany.sh: _strtonum1: not found
gmake[2]: [Makefile:5688: strtonum1] Error 1 (ignored)
stupid1
./checkmany.sh: -s}: not found
./checkmany.sh: _stupid1: not found
./checkmany.sh: _stupid1: not found
gmake[2]: [Makefile:5693: stupid1] Error 1 (ignored)
stupid2
./checkmany.sh: -s}: not found
./checkmany.sh: _stupid2: not found
./checkmany.sh: _stupid2: not found
gmake[2]: [Makefile:5698: stupid2] Error 1 (ignored)
stupid3
./checkmany.sh: -s}: not found
./checkmany.sh: _stupid3: not found
./checkmany.sh: _stupid3: not found
gmake[2]: [Makefile:5703: stupid3] Error 1 (ignored)
stupid4
./checkmany.sh: -s}: not found
./checkmany.sh: _stupid4: not found
./checkmany.sh: _stupid4: not found
gmake[2]: [Makefile:5708: stupid4] Error 1 (ignored)
stupid5
./checkmany.sh: -s}: not found
./checkmany.sh: _stupid5: not found
./checkmany.sh: _stupid5: not found
gmake[2]: [Makefile:5713: stupid5] Error 1 (ignored)
switch2
./checkmany.sh: -s}: not found
./checkmany.sh: _switch2: not found
./checkmany.sh: _switch2: not found
gmake[2]: [Makefile:5718: switch2] Error 1 (ignored)
symtab1
./checkmany.sh: -s}: not found
./checkmany.sh: _symtab1: not found
./checkmany.sh: _symtab1: not found
./checkmany.sh: _symtab1: not found
./checkmany.sh: _symtab1: not found
gmake[2]: [Makefile:5723: symtab1] Error 1 (ignored)
symtab2
./checkmany.sh: -s}: not found
./checkmany.sh: _symtab2: not found
./checkmany.sh: _symtab2: not found
gmake[2]: [Makefile:5728: symtab2] Error 1 (ignored)
symtab3
./checkmany.sh: -s}: not found
./checkmany.sh: _symtab3: not found
./checkmany.sh: _symtab3: not found
gmake[2]: [Makefile:5733: symtab3] Error 1 (ignored)
symtab4
./checkmany.sh: -s}: not found
./checkmany.sh: _symtab4: not found
./checkmany.sh: _symtab4: not found
gmake[2]: [Makefile:5738: symtab4] Error 1 (ignored)
symtab5
./checkmany.sh: -s}: not found
./checkmany.sh: _symtab5: not found
./checkmany.sh: _symtab5: not found
gmake[2]: [Makefile:5743: symtab5] Error 1 (ignored)
symtab6
./checkmany.sh: -s}: not found
./checkmany.sh: _symtab6: not found
./checkmany.sh: _symtab6: not found
gmake[2]: [Makefile:3132: symtab6] Error 1 (ignored)
symtab7
./checkmany.sh: -s}: not found
./checkmany.sh: _symtab7: not found
./checkmany.sh: _symtab7: not found
gmake[2]: [Makefile:5748: symtab7] Error 1 (ignored)
symtab8
./checkmany.sh: -s}: not found
./checkmany.sh: _symtab8: not found
./checkmany.sh: _symtab8: not found
./checkmany.sh: _symtab8: not found
./checkmany.sh: _symtab8: not found
gmake[2]: [Makefile:3138: symtab8] Error 1 (ignored)
symtab9
./checkmany.sh: -s}: not found
./checkmany.sh: _symtab9: not found
./checkmany.sh: _symtab9: not found
gmake[2]: [Makefile:3144: symtab9] Error 1 (ignored)
symtab10
./checkmany.sh: -s}: not found
./checkmany.sh: _symtab10: not found
./checkmany.sh: _symtab10: not found
gmake[2]: [Makefile:5753: symtab10] Error 1 (ignored)
symtab11
./checkmany.sh: -s}: not found
./checkmany.sh: _symtab11: not found
./checkmany.sh: _symtab11: not found
./checkmany.sh: _symtab11: not found
./checkmany.sh: _symtab11: not found
gmake[2]: [Makefile:5758: symtab11] Error 1 (ignored)
symtab12
./checkmany.sh: -s}: not found
./checkmany.sh: _symtab12: not found
./checkmany.sh: _symtab12: not found
gmake[2]: [Makefile:5763: symtab12] Error 1 (ignored)
symtab13
./checkmany.sh: -s}: not found
./checkmany.sh: _symtab13: not found
./checkmany.sh: _symtab13: not found
gmake[2]: [Makefile:5768: symtab13] Error 1 (ignored)
timeout
./checkmany.sh: -s}: not found
./checkmany.sh: _timeout: not found
./checkmany.sh: _timeout: not found
./checkmany.sh: _timeout: not found
./checkmany.sh: _timeout: not found
gmake[2]: [Makefile:5773: timeout] Error 1 (ignored)
typedregex1
./checkmany.sh: -s}: not found
./checkmany.sh: _typedregex1: not found
./checkmany.sh: _typedregex1: not found
gmake[2]: [Makefile:5778: typedregex1] Error 1 (ignored)
typedregex2
./checkmany.sh: -s}: not found
./checkmany.sh: _typedregex2: not found
./checkmany.sh: _typedregex2: not found
gmake[2]: [Makefile:5783: typedregex2] Error 1 (ignored)
typedregex3
./checkmany.sh: -s}: not found
./checkmany.sh: _typedregex3: not found
./checkmany.sh: _typedregex3: not found
gmake[2]: [Makefile:5788: typedregex3] Error 1 (ignored)
typedregex4
./checkmany.sh: -s}: not found
./checkmany.sh: _typedregex4: not found
./checkmany.sh: _typedregex4: not found
gmake[2]: [Makefile:3240: typedregex4] Error 1 (ignored)
typedregex5
./checkmany.sh: -s}: not found
./checkmany.sh: _typedregex5: not found
./checkmany.sh: _typedregex5: not found
gmake[2]: [Makefile:5793: typedregex5] Error 1 (ignored)
typedregex6
./checkmany.sh: -s}: not found
./checkmany.sh: _typedregex6: not found
./checkmany.sh: _typedregex6: not found
gmake[2]: [Makefile:5798: typedregex6] Error 1 (ignored)
typeof1
./checkmany.sh: -s}: not found
./checkmany.sh: _typeof1: not found
./checkmany.sh: _typeof1: not found
gmake[2]: [Makefile:5803: typeof1] Error 1 (ignored)
typeof2
./checkmany.sh: -s}: not found
./checkmany.sh: _typeof2: not found
./checkmany.sh: _typeof2: not found
gmake[2]: [Makefile:5808: typeof2] Error 1 (ignored)
typeof3
./checkmany.sh: -s}: not found
./checkmany.sh: _typeof3: not found
./checkmany.sh: _typeof3: not found
gmake[2]: [Makefile:5813: typeof3] Error 1 (ignored)
typeof4
./checkmany.sh: -s}: not found
./checkmany.sh: _typeof4: not found
./checkmany.sh: _typeof4: not found
gmake[2]: [Makefile:5818: typeof4] Error 1 (ignored)
typeof5
./checkmany.sh: -s}: not found
./checkmany.sh: _typeof5: not found
./checkmany.sh: _typeof5: not found
gmake[2]: [Makefile:5823: typeof5] Error 1 (ignored)
typeof6
./checkmany.sh: -s}: not found
./checkmany.sh: _typeof6: not found
./checkmany.sh: _typeof6: not found
gmake[2]: [Makefile:5828: typeof6] Error 1 (ignored)
typeof7
./checkmany.sh: -s}: not found
./checkmany.sh: _typeof7: not found
./checkmany.sh: _typeof7: not found
gmake[2]: [Makefile:5833: typeof7] Error 1 (ignored)
typeof8
./checkmany.sh: -s}: not found
./checkmany.sh: _typeof8: not found
./checkmany.sh: _typeof8: not found
gmake[2]: [Makefile:5838: typeof8] Error 1 (ignored)
typeof9
./checkmany.sh: -s}: not found
./checkmany.sh: _typeof9: not found
./checkmany.sh: _typeof9: not found
gmake[2]: [Makefile:5843: typeof9] Error 1 (ignored)
unicode1
./checkmany.sh: -s}: not found
./checkmany.sh: _unicode1: not found
./checkmany.sh: _unicode1: not found
./checkmany.sh: _unicode1: not found
./checkmany.sh: _unicode1: not found
gmake[2]: [Makefile:5848: unicode1] Error 1 (ignored)
watchpoint1
./checkmany.sh: -s}: not found
./checkmany.sh: _watchpoint1: not found
./checkmany.sh: _watchpoint1: not found
gmake[2]: [Makefile:3183: watchpoint1] Error 1 (ignored)
gawk is not compiled to support the array debug tests
======== Done with gawk extension tests ========
%%%%%%%%%% Inadequate locale support: skipping charset tests.
%%%%%%%%%% At least en_US.UTF-8, fr_FR.UTF-8, ru_RU.UTF-8, ja_JP.UTF-8 and el_GR.iso88597@euro are needed.
======== Starting dynamic extension tests ========
gmake[3]: Entering directory '/export/home/buildbot/slave/gawk-solaris10-i386/build/test'
apiterm
./checkmany.sh: -s}: not found
./checkmany.sh: _apiterm: not found
./checkmany.sh: _apiterm: not found
gmake[3]: [Makefile:6010: apiterm] Error 1 (ignored)
filefuncs
./checkmany.sh: -s}: not found
./checkmany.sh: _filefuncs: not found
./checkmany.sh: _filefuncs: not found
gmake[3]: [Makefile:3168: filefuncs] Error 1 (ignored)
fnmatch
./checkmany.sh: -s}: not found
./checkmany.sh: _fnmatch: not found
./checkmany.sh: _fnmatch: not found
gmake[3]: [Makefile:6015: fnmatch] Error 1 (ignored)
fork
./checkmany.sh: -s}: not found
./checkmany.sh: _fork: not found
./checkmany.sh: _fork: not found
gmake[3]: [Makefile:6020: fork] Error 1 (ignored)
fork2
./checkmany.sh: -s}: not found
./checkmany.sh: _fork2: not found
./checkmany.sh: _fork2: not found
gmake[3]: [Makefile:6025: fork2] Error 1 (ignored)
fts
functab4
./checkmany.sh: -s}: not found
./checkmany.sh: _functab4: not found
./checkmany.sh: _functab4: not found
gmake[3]: [Makefile:6030: functab4] Error 1 (ignored)
functab5
./checkmany.sh: -s}: not found
./checkmany.sh: _functab5: not found
./checkmany.sh: _functab5: not found
gmake[3]: [Makefile:6035: functab5] Error 1 (ignored)
getfile
./checkmany.sh: -s}: not found
./checkmany.sh: _getfile: not found
./checkmany.sh: _getfile: not found
gmake[3]: [Makefile:3069: getfile] Error 1 (ignored)
indirectbuiltin2
./checkmany.sh: -s}: not found
./checkmany.sh: _indirectbuiltin2: not found
./checkmany.sh: _indirectbuiltin2: not found
gmake[3]: [Makefile:3257: indirectbuiltin2] Error 1 (ignored)
inplace1
./checkmany.sh: -s}: not found
./checkmany.sh: _inplace1: not found
./checkmany.sh: _inplace1: not found
gmake[3]: [Makefile:3006: inplace1] Error 1 (ignored)
inplace2
./checkmany.sh: -s}: not found
./checkmany.sh: _inplace2: not found
./checkmany.sh: _inplace2: not found
gmake[3]: [Makefile:3016: inplace2] Error 1 (ignored)
inplace2bcomp
./checkmany.sh: -s}: not found
./checkmany.sh: _inplace2bcomp: not found
./checkmany.sh: _inplace2bcomp: not found
gmake[3]: [Makefile:3028: inplace2bcomp] Error 1 (ignored)
inplace3
./checkmany.sh: -s}: not found
./checkmany.sh: _inplace3: not found
./checkmany.sh: _inplace3: not found
gmake[3]: [Makefile:3041: inplace3] Error 1 (ignored)
inplace3bcomp
./checkmany.sh: -s}: not found
./checkmany.sh: _inplace3bcomp: not found
./checkmany.sh: _inplace3bcomp: not found
gmake[3]: [Makefile:3054: inplace3bcomp] Error 1 (ignored)
ordchr
./checkmany.sh: -s}: not found
./checkmany.sh: _ordchr: not found
./checkmany.sh: _ordchr: not found
gmake[3]: [Makefile:6040: ordchr] Error 1 (ignored)
ordchr2
./checkmany.sh: -s}: not found
./checkmany.sh: _ordchr2: not found
./checkmany.sh: _ordchr2: not found
gmake[3]: [Makefile:2922: ordchr2] Error 1 (ignored)
readall
./checkmany.sh: -s}: not found
./checkmany.sh: _readall: not found
./checkmany.sh: _readall: not found
gmake[3]: [Makefile:3105: readall] Error 1 (ignored)
readdir
readdir_retest
readdir_test
readfile
readfile2
./checkmany.sh: -s}: not found
./checkmany.sh: _readfile2: not found
./checkmany.sh: _readfile2: not found
gmake[3]: [Makefile:2933: readfile2] Error 1 (ignored)
revout
./checkmany.sh: -s}: not found
./checkmany.sh: _revout: not found
./checkmany.sh: _revout: not found
gmake[3]: [Makefile:6046: revout] Error 1 (ignored)
revtwoway
./checkmany.sh: -s}: not found
./checkmany.sh: _revtwoway: not found
./checkmany.sh: _revtwoway: not found
gmake[3]: [Makefile:6051: revtwoway] Error 1 (ignored)
rwarray
./checkmany.sh: -s}: not found
./checkmany.sh: _rwarray: not found
./checkmany.sh: _rwarray: not found
gmake[3]: [Makefile:6056: rwarray] Error 1 (ignored)
testext
./checkmany.sh: -s}: not found
./checkmany.sh: _testext: not found
./checkmany.sh: _testext: not found
./checkmany.sh: _testext: not found
./checkmany.sh: _testext: not found
gmake[3]: [Makefile:3064: testext] Error 1 (ignored)
time
./checkmany.sh: -s}: not found
./checkmany.sh: _time: not found
./checkmany.sh: _time: not found
gmake[3]: [Makefile:6061: time] Error 1 (ignored)
gmake[3]: Leaving directory '/export/home/buildbot/slave/gawk-solaris10-i386/build/test'
======== Done with dynamic extension tests ========
======== Starting MPFR tests ========
MPFR tests not supported on this system
======== Done with MPFR tests ========
======== Starting PMA tests ========
PMA tests not supported on this system
======== Done with PMA tests ========
======== Starting machine-specific tests ========
If any of these tests fail, don't worry too much.
double1
./checkmany.sh: -s}: not found
./checkmany.sh: _double1: not found
./checkmany.sh: _double1: not found
./checkmany.sh: _double1: not found
./checkmany.sh: _double1: not found
gmake[2]: [Makefile:5854: double1] Error 1 (ignored)
double2
./checkmany.sh: -s}: not found
./checkmany.sh: _double2: not found
./checkmany.sh: _double2: not found
./checkmany.sh: _double2: not found
./checkmany.sh: _double2: not found
gmake[2]: [Makefile:5859: double2] Error 1 (ignored)
inf-nan-torture
./checkmany.sh: -s}: not found
./checkmany.sh: _inf-nan-torture: not found
./checkmany.sh: _inf-nan-torture: not found
./checkmany.sh: _inf-nan-torture: not found
./checkmany.sh: _inf-nan-torture: not found
gmake[2]: [Makefile:5864: inf-nan-torture] Error 1 (ignored)
intformat
./checkmany.sh: -s}: not found
./checkmany.sh: _intformat: not found
./checkmany.sh: _intformat: not found
gmake[2]: [Makefile:5869: intformat] Error 1 (ignored)
======== Done with machine-specific tests ========
gmake[3]: Entering directory '/export/home/buildbot/slave/gawk-solaris10-i386/build/test'
614 TESTS FAILED
gmake[3]: *** [Makefile:6143: pass-fail] Error 1
gmake[3]: Leaving directory '/export/home/buildbot/slave/gawk-solaris10-i386/build/test'
gmake[3]: Entering directory '/export/home/buildbot/slave/gawk-solaris10-i386/build/test'
for i in _* ; \
do \
if [ "$i" != "_*" ]; then \
echo ============== $i ============= ; \
base=`echo $i | sed 's/^_//'` ; \
if echo "$GAWK_TEST_ARGS" | egrep -s -e '-M|--bignum' > /dev/null && [ -r ${base}.ok-mpfr ]; then \
diff -u ${base}.ok-mpfr $i ; \
elif echo "$GAWK_TEST_ARGS" | egrep -s -e '-M|--bignum' > /dev/null && [ -r "."/${base}.ok-mpfr ]; then \
diff -u "."/${base}.ok-mpfr $i ; \
elif [ -r ${base}.ok ]; then \
diff -u ${base}.ok $i ; \
else \
diff -u "."/${base}.ok $i ; \
fi ; \
fi ; \
done | ${PAGER:-more}
============== _aadelete1 =============
No differences encountered
============== _aadelete2 =============
No differences encountered
============== _aarray1 =============
No differences encountered
============== _aasort =============
No differences encountered
============== _aasorti =============
No differences encountered
============== _addcomma =============
No differences encountered
============== _anchgsub =============
No differences encountered
============== _anchor =============
No differences encountered
============== _apiterm =============
No differences encountered
============== _ar2fn_elnew_sc =============
No differences encountered
============== _ar2fn_elnew_sc2 =============
No differences encountered
============== _ar2fn_fmod =============
No differences encountered
============== _ar2fn_unxptyp_aref =============
No differences encountered
============== _ar2fn_unxptyp_val =============
No differences encountered
============== _argarray =============
No differences encountered
============== _argcasfile =============
No differences encountered
============== _argtest =============
No differences encountered
============== _arrayind1 =============
No differences encountered
============== _arrayind2 =============
No differences encountered
============== _arrayind3 =============
No differences encountered
============== _arrayparm =============
No differences encountered
============== _arrayprm2 =============
No differences encountered
============== _arrayprm3 =============
No differences encountered
============== _arrayref =============
No differences encountered
============== _arraysort =============
No differences encountered
============== _arraysort2 =============
No differences encountered
============== _arraytype =============
No differences encountered
============== _arrymem1 =============
No differences encountered
============== _arryref2 =============
No differences encountered
============== _arryref3 =============
No differences encountered
============== _arryref4 =============
No differences encountered
============== _arryref5 =============
No differences encountered
============== _arynasty =============
No differences encountered
============== _arynocls =============
No differences encountered
============== _aryprm1 =============
No differences encountered
============== _aryprm2 =============
No differences encountered
============== _aryprm3 =============
No differences encountered
============== _aryprm4 =============
No differences encountered
============== _aryprm5 =============
No differences encountered
============== _aryprm6 =============
No differences encountered
============== _aryprm7 =============
No differences encountered
============== _aryprm8 =============
No differences encountered
============== _aryprm9 =============
No differences encountered
============== _arysubnm =============
No differences encountered
============== _aryunasgn =============
No differences encountered
============== _asgext =============
No differences encountered
============== _asortbool =============
No differences encountered
============== _asortsymtab =============
No differences encountered
============== _assignnumfield =============
No differences encountered
============== _assignnumfield2 =============
No differences encountered
============== _assignnumfield3 =============
No differences encountered
============== _awkpath =============
No differences encountered
============== _back89 =============
No differences encountered
============== _backgsub =============
No differences encountered
============== _backw =============
No differences encountered
============== _badargs =============
No differences encountered
============== _badassign1 =============
No differences encountered
============== _badbuild =============
No differences encountered
============== _beginfile1 =============
No differences encountered
============== _beginfile2 =============
No differences encountered
============== _binmode1 =============
No differences encountered
============== _callparam =============
No differences encountered
============== _case-check =============
--- case-check.ok Wed Oct 14 18:02:01 2026
+++ _case-check Wed Oct 14 18:05:29 2026
@@ -9,16 +9,16 @@
Ω ~ ω: expect true, got true
ω ~ Ω: expect true, got true
Ω ~ ω: expect false, got false
- ω ~ Ω: expect true, got true
+ ω ~ Ω: expect true, got false
Ω ~ Ω: expect false, got false
Ω ~ Ω: expect false, got false
case (iii)
ẞ ~ ß: expect false, got false
- ß ~ ẞ: expect true, got true
+ ß ~ ẞ: expect true, got false
case (iv)
DŽ ~ dž: expect true, got true
dž ~ DŽ: expect true, got true
- DŽ ~ Dž: expect true, got true
+ DŽ ~ Dž: expect true, got false
Dž ~ DŽ: expect false, got false
- dž ~ Dž: expect true, got true
+ dž ~ Dž: expect true, got false
Dž ~ dž: expect false, got false
============== _charasbytes =============
No differences encountered
============== _childin =============
No differences encountered
============== _clos1way =============
No differences encountered
============== _clos1way2 =============
No differences encountered
============== _clos1way3 =============
No differences encountered
============== _clos1way4 =============
No differences encountered
============== _clos1way5 =============
No differences encountered
============== _clos1way6 =============
No differences encountered
============== _close_status =============
No differences encountered
============== _closebad =============
No differences encountered
============== _clsflnam =============
No differences encountered
============== _cmdlinefsbacknl =============
No differences encountered
============== _cmdlinefsbacknl2 =============
--- cmdlinefsbacknl2.ok Wed Oct 14 18:02:01 2026
+++ _cmdlinefsbacknl2 Wed Oct 14 18:05:30 2026
@@ -1,23 +1,2 @@
- 5c 0a
- 5c 0a
- 5c 0a
- 5c 0a
- 5c 0a
- 5c 0a
-gawk: cmd. line:2: warning: invalid `\u' escape sequence
-gawk: cmd. line:3: warning: invalid `\u' escape sequence
- 3f 0a 3f 0a
-gawk: cmd. line:2: warning: invalid `\u' escape sequence
-right: literal ? is literal
-gawk: cmd. line:2: warning: invalid `\u' escape sequence
-gawk: cmd. line:5: warning: invalid `\u' escape sequence
-gawk: cmd. line:8: warning: invalid `\u' escape sequence
-1 == 1
-gawk: cmd. line:3: warning: invalid `\u' escape sequence
-1 == 1
-0 == 0
-gawk: cmd. line:6: warning: invalid `\u' escape sequence
-0 == 0
-0 == 0
-gawk: cmd. line:9: warning: invalid `\u' escape sequence
-0 == 0
+./cmdlinefsbacknl2.sh: LC_CTYPE=en_US.UTF-8: is not an identifier
+EXIT CODE: 1
============== _colonwarn =============
No differences encountered
============== _compare =============
No differences encountered
============== _compare2 =============
No differences encountered
============== _concat1 =============
No differences encountered
============== _concat2 =============
No differences encountered
============== _concat3 =============
No differences encountered
============== _concat4 =============
No differences encountered
============== _concat5 =============
No differences encountered
============== _convfmt =============
No differences encountered
============== _crlf =============
No differences encountered
============== _csv1 =============
No differences encountered
============== _csv2 =============
No differences encountered
============== _csv3 =============
No differences encountered
============== _csvodd =============
No differences encountered
============== _datanonl =============
No differences encountered
============== _dbugarray1 =============
No differences encountered
============== _dbugarray2 =============
No differences encountered
============== _dbugarray3 =============
No differences encountered
============== _dbugarray4 =============
No differences encountered
============== _dbugbadcmd =============
--- dbugbadcmd.ok Wed Oct 14 18:02:01 2026
+++ _dbugbadcmd Wed Oct 14 18:06:24 2026
@@ -62,8 +62,6 @@
return [value] - make selected stack frame return to its caller
run:
run - start or restart executing program
-save:
- save filename - save commands from the session to file
set:
set var = value - assign value to a scalar variable
silent:
============== _dbugbreak =============
No differences encountered
============== _dbugeval2 =============
No differences encountered
============== _dbugeval3 =============
No differences encountered
============== _dbugeval4 =============
No differences encountered
============== _dbugtypedre1 =============
No differences encountered
============== _dbugtypedre2 =============
No differences encountered
============== _defref =============
No differences encountered
============== _delargv =============
No differences encountered
============== _delarpm2 =============
No differences encountered
============== _delarprm =============
No differences encountered
============== _delfunc =============
No differences encountered
============== _delmessy =============
No differences encountered
============== _delsub =============
No differences encountered
============== _devfd =============
No differences encountered
============== _devfd1 =============
No differences encountered
============== _devfd2 =============
No differences encountered
============== _dfacheck1 =============
No differences encountered
============== _dfacheck2 =============
No differences encountered
============== _dfamb1 =============
No differences encountered
============== _dfastress =============
No differences encountered
============== _divzero =============
No differences encountered
============== _divzero2 =============
No differences encountered
============== _double1 =============
No differences encountered
============== _double2 =============
No differences encountered
============== _dumpvars =============
No differences encountered
============== _dynlj =============
No differences encountered
============== _elemnew1 =============
No differences encountered
============== _elemnew2 =============
No differences encountered
============== _elemnew3 =============
No differences encountered
============== _elemnew4 =============
No differences encountered
============== _elemnew5 =============
No differences encountered
============== _elemnew6 =============
No differences encountered
============== _elemnew7 =============
No differences encountered
============== _eofsplit =============
No differences encountered
============== _eofsrc1 =============
No differences encountered
============== _equiv =============
No differences encountered
============== _errno =============
No differences encountered
============== _escapebrace =============
No differences encountered
============== _exit =============
No differences encountered
============== _exit2 =============
No differences encountered
============== _exitval1 =============
No differences encountered
============== _exitval2 =============
No differences encountered
============== _exitval3 =============
No differences encountered
============== _fcall_exit =============
No differences encountered
============== _fcall_exit2 =============
No differences encountered
============== _fflush =============
No differences encountered
============== _fieldassign =============
No differences encountered
============== _fieldindex =============
No differences encountered
============== _fieldwdth =============
No differences encountered
============== _filefuncs =============
No differences encountered
============== _fldchg =============
No differences encountered
============== _fldchgnf =============
No differences encountered
============== _fldterm =============
No differences encountered
============== _fmtmix =============
No differences encountered
============== _fnamedat =============
No differences encountered
============== _fnarray =============
No differences encountered
============== _fnarray2 =============
No differences encountered
============== _fnaryscl =============
No differences encountered
============== _fnasgnm =============
No differences encountered
============== _fnmatch =============
No differences encountered
============== _fnmisc =============
No differences encountered
============== _forcenum =============
No differences encountered
============== _fordel =============
No differences encountered
============== _fork =============
No differences encountered
============== _fork2 =============
No differences encountered
============== _forref =============
No differences encountered
============== _forsimp =============
No differences encountered
============== _fpat1 =============
No differences encountered
============== _fpat2 =============
No differences encountered
============== _fpat3 =============
No differences encountered
============== _fpat4 =============
No differences encountered
============== _fpat5 =============
No differences encountered
============== _fpat6 =============
No differences encountered
============== _fpat7 =============
No differences encountered
============== _fpat8 =============
No differences encountered
============== _fpat9 =============
No differences encountered
============== _fpatnull =============
No differences encountered
============== _fsbs =============
No differences encountered
============== _fscaret =============
No differences encountered
============== _fsfwfs =============
No differences encountered
============== _fsnul1 =============
No differences encountered
============== _fsrs =============
No differences encountered
============== _fsspcoln =============
No differences encountered
============== _fstabplus =============
No differences encountered
============== _functab1 =============
No differences encountered
============== _functab2 =============
No differences encountered
============== _functab3 =============
No differences encountered
============== _functab4 =============
No differences encountered
============== _functab5 =============
No differences encountered
============== _functab6 =============
No differences encountered
============== _funlen =============
No differences encountered
============== _funsemnl =============
No differences encountered
============== _funsmnam =============
No differences encountered
============== _funstack =============
No differences encountered
============== _fwtest =============
No differences encountered
============== _fwtest2 =============
No differences encountered
============== _fwtest3 =============
No differences encountered
============== _fwtest4 =============
No differences encountered
============== _fwtest5 =============
No differences encountered
============== _fwtest6 =============
No differences encountered
============== _fwtest7 =============
No differences encountered
============== _fwtest8 =============
No differences encountered
============== _genpot =============
No differences encountered
============== _gensub =============
No differences encountered
============== _gensub2 =============
No differences encountered
============== _gensub3 =============
No differences encountered
============== _gensub4 =============
No differences encountered
============== _gensub5 =============
No differences encountered
============== _getfile =============
No differences encountered
============== _getline =============
No differences encountered
============== _getline2 =============
No differences encountered
============== _getline3 =============
No differences encountered
============== _getline4 =============
No differences encountered
============== _getline5 =============
No differences encountered
============== _getlndir =============
No differences encountered
============== _getlnfa =============
No differences encountered
============== _getlnhd =============
No differences encountered
============== _getnr2tb =============
No differences encountered
============== _getnr2tm =============
No differences encountered
============== _gnuops2 =============
No differences encountered
============== _gnuops3 =============
No differences encountered
============== _gnureops =============
No differences encountered
============== _greek-equiv =============
No differences encountered
============== _greek-utf =============
No differences encountered
============== _gsubasgn =============
No differences encountered
============== _gsubind =============
No differences encountered
============== _gsubnulli18n =============
No differences encountered
============== _gsubtest =============
No differences encountered
============== _gsubtst2 =============
No differences encountered
============== _gsubtst3 =============
No differences encountered
============== _gsubtst4 =============
No differences encountered
============== _gsubtst5 =============
No differences encountered
============== _gsubtst6 =============
No differences encountered
============== _gsubtst7 =============
No differences encountered
============== _gsubtst8 =============
No differences encountered
============== _hex =============
No differences encountered
============== _hex2 =============
No differences encountered
============== _hex3 =============
No differences encountered
============== _hexfloat =============
No differences encountered
============== _hsprint =============
No differences encountered
============== _icasefs =============
No differences encountered
============== _icasers =============
No differences encountered
============== _id =============
No differences encountered
============== _igncdym =============
No differences encountered
============== _igncfs =============
No differences encountered
============== _ignrcas2 =============
No differences encountered
============== _ignrcas4 =============
No differences encountered
============== _ignrcase =============
No differences encountered
============== _incdupe =============
No differences encountered
============== _incdupe2 =============
No differences encountered
============== _incdupe3 =============
No differences encountered
============== _incdupe4 =============
No differences encountered
============== _incdupe5 =============
No differences encountered
============== _incdupe6 =============
No differences encountered
============== _incdupe7 =============
No differences encountered
============== _include =============
No differences encountered
============== _include2 =============
No differences encountered
============== _indirectbuiltin =============
--- indirectbuiltin.ok Wed Oct 14 18:02:01 2026
+++ _indirectbuiltin Wed Oct 14 18:06:29 2026
@@ -17,9 +17,7 @@
string: gensub (3 args): pass
string: gsub: pass
string: index: pass
-gawk: indirectbuiltin.awk:127: warning: dcgettext is deprecated and will be removed in the next major release
string: dcgettext: pass
-gawk: indirectbuiltin.awk:132: warning: dcngettext is deprecated and will be removed in the next major release
string: dcngettext: pass
string: length: pass
string: sprintf: pass
============== _indirectbuiltin2 =============
No differences encountered
============== _indirectbuiltin3 =============
No differences encountered
============== _indirectbuiltin4 =============
No differences encountered
============== _indirectbuiltin5 =============
No differences encountered
============== _indirectbuiltin6 =============
No differences encountered
============== _indirectbuiltin7 =============
No differences encountered
============== _indirectbuiltin8 =============
No differences encountered
============== _indirectbuiltin9 =============
No differences encountered
============== _indirectcall =============
No differences encountered
============== _indirectcall2 =============
No differences encountered
============== _indirectcall3 =============
No differences encountered
============== _inf-nan-torture =============
No differences encountered
============== _inplace1 =============
No differences encountered
============== _inplace2 =============
No differences encountered
============== _inplace2bcomp =============
No differences encountered
============== _inplace3 =============
No differences encountered
============== _inplace3bcomp =============
No differences encountered
============== _inpref =============
No differences encountered
============== _inputred =============
No differences encountered
============== _intarray =============
No differences encountered
============== _intest =============
No differences encountered
============== _intformat =============
No differences encountered
============== _intprec =============
No differences encountered
============== _iobug1 =============
No differences encountered
============== _iolint =============
--- iolint.ok Wed Oct 14 18:02:01 2026
+++ _iolint Wed Oct 14 18:06:30 2026
@@ -27,6 +27,6 @@
0
0
gawk: iolint.awk:76: warning: `cksum' used for output file and output pipe
-3015617425 6
+3015617425 6
0
0
============== _isarrayunset =============
No differences encountered
============== _leaddig =============
No differences encountered
============== _leadnl =============
No differences encountered
============== _lint =============
No differences encountered
============== _lintexp =============
No differences encountered
============== _lintindex =============
No differences encountered
============== _lintint =============
No differences encountered
============== _lintlength =============
No differences encountered
============== _lintplus =============
No differences encountered
============== _lintplus2 =============
No differences encountered
============== _lintplus3 =============
No differences encountered
============== _lintset =============
No differences encountered
============== _lintsubarray =============
No differences encountered
============== _linttypeof =============
No differences encountered
============== _lintwarn =============
No differences encountered
============== _litoct =============
No differences encountered
============== _localenl =============
--- localenl.ok Wed Oct 14 18:02:01 2026
+++ _localenl Wed Oct 14 18:06:08 2026
@@ -1,4 +1,1 @@
-LC_ALL=C passed
-LC_ALL=POSIX passed
-LC_ALL=en_US.ISO-8859-1 passed
-LC_ALL=en_US.UTF-8 passed
+EXIT CODE: 1
============== _longsub =============
No differences encountered
============== _longwrds =============
No differences encountered
============== _manglprm =============
No differences encountered
============== _manyfiles =============
No differences encountered
============== _match1 =============
No differences encountered
============== _match2 =============
No differences encountered
============== _match3 =============
No differences encountered
============== _match4 =============
No differences encountered
============== _match5 =============
No differences encountered
============== _matchbadarg1 =============
No differences encountered
============== _matchbadarg2 =============
No differences encountered
============== _matchuninitialized =============
No differences encountered
============== _math =============
No differences encountered
============== _mdim1 =============
No differences encountered
============== _mdim2 =============
No differences encountered
============== _mdim3 =============
No differences encountered
============== _mdim4 =============
No differences encountered
============== _mdim5 =============
No differences encountered
============== _mdim6 =============
No differences encountered
============== _mdim7 =============
No differences encountered
============== _mdim8 =============
No differences encountered
============== _mdim9 =============
No differences encountered
============== _membug1 =============
No differences encountered
============== _memleak =============
No differences encountered
============== _memleak2 =============
No differences encountered
============== _memleak3 =============
No differences encountered
============== _memleak4 =============
No differences encountered
============== _minusstr =============
No differences encountered
============== _mixed1 =============
No differences encountered
============== _mktime =============
No differences encountered
============== _mmap8k =============
No differences encountered
============== _modifiers =============
No differences encountered
============== _muldimposix =============
No differences encountered
============== _nasty =============
No differences encountered
============== _nasty2 =============
No differences encountered
============== _nastyparm =============
No differences encountered
============== _negexp =============
No differences encountered
============== _negrange =============
No differences encountered
============== _nested =============
No differences encountered
============== _next =============
No differences encountered
============== _nfldstr =============
No differences encountered
============== _nfloop =============
No differences encountered
============== _nfneg =============
No differences encountered
============== _nfset =============
No differences encountered
============== _nlfldsep =============
No differences encountered
============== _nlinstr =============
No differences encountered
============== _nlstrina =============
No differences encountered
============== _noeffect =============
No differences encountered
============== _nofile =============
No differences encountered
============== _nofmtch =============
No differences encountered
============== _noloop1 =============
No differences encountered
============== _noloop2 =============
No differences encountered
============== _nondec =============
No differences encountered
============== _nondec2 =============
No differences encountered
============== _nonfatal1 =============
No differences encountered
============== _nonfatal2 =============
No differences encountered
============== _nonfatal3 =============
No differences encountered
============== _nonl =============
No differences encountered
============== _noparms =============
No differences encountered
============== _nors =============
No differences encountered
============== _nsawk1a =============
No differences encountered
============== _nsawk1b =============
No differences encountered
============== _nsawk1c =============
No differences encountered
============== _nsawk2a =============
No differences encountered
============== _nsawk2b =============
No differences encountered
============== _nsbad =============
No differences encountered
============== _nsbad2 =============
No differences encountered
============== _nsbad3 =============
No differences encountered
============== _nsbad_cmd =============
No differences encountered
============== _nsforloop =============
No differences encountered
============== _nsfuncrecurse =============
No differences encountered
============== _nsidentifier =============
No differences encountered
============== _nsindirect1 =============
No differences encountered
============== _nsindirect2 =============
No differences encountered
============== _nsprof1 =============
No differences encountered
============== _nsprof2 =============
No differences encountered
============== _nsprof3 =============
No differences encountered
============== _nulinsrc =============
No differences encountered
============== _nulrsend =============
No differences encountered
============== _numindex =============
No differences encountered
============== _numrange =============
No differences encountered
============== _numstr1 =============
No differences encountered
============== _numsubstr =============
No differences encountered
============== _octdec =============
No differences encountered
============== _octsub =============
No differences encountered
============== _ofmt =============
No differences encountered
============== _ofmta =============
No differences encountered
============== _ofmtbig =============
No differences encountered
============== _ofmtfidl =============
No differences encountered
============== _ofmts =============
No differences encountered
============== _ofmtstrnum =============
No differences encountered
============== _ofs1 =============
No differences encountered
============== _onlynl =============
No differences encountered
============== _opasnidx =============
No differences encountered
============== _opasnslf =============
No differences encountered
============== _ordchr =============
No differences encountered
============== _ordchr2 =============
No differences encountered
============== _paramasfunc1 =============
No differences encountered
============== _paramasfunc2 =============
No differences encountered
============== _paramdup =============
No differences encountered
============== _paramres =============
No differences encountered
============== _paramtyp =============
No differences encountered
============== _paramuninitglobal =============
No differences encountered
============== _parse1 =============
No differences encountered
============== _parsefld =============
No differences encountered
============== _parseme =============
No differences encountered
============== _patsplit =============
No differences encountered
============== _pcntplus =============
No differences encountered
============== _pid =============
No differences encountered
============== _pipeio1 =============
No differences encountered
============== _pipeio2 =============
No differences encountered
============== _posix =============
No differences encountered
============== _posix-inf =============
No differences encountered
============== _posix2008sub =============
No differences encountered
============== _posix_compare =============
No differences encountered
============== _prdupval =============
No differences encountered
============== _prec =============
No differences encountered
============== _printf-corners =============
No differences encountered
============== _printf0 =============
No differences encountered
============== _printf1 =============
No differences encountered
============== _printfbad1 =============
No differences encountered
============== _printfbad2 =============
No differences encountered
============== _printfbad3 =============
No differences encountered
============== _printfbad4 =============
No differences encountered
============== _printfchar =============
No differences encountered
============== _printhuge =============
No differences encountered
============== _prmarscl =============
No differences encountered
============== _prmreuse =============
No differences encountered
============== _procinfs =============
No differences encountered
============== _profile0 =============
No differences encountered
============== _profile10 =============
No differences encountered
============== _profile11 =============
No differences encountered
============== _profile12 =============
No differences encountered
============== _profile13 =============
No differences encountered
============== _profile14 =============
No differences encountered
============== _profile15 =============
No differences encountered
============== _profile16 =============
No differences encountered
============== _profile17 =============
No differences encountered
============== _profile2 =============
No differences encountered
============== _profile3 =============
No differences encountered
============== _profile4 =============
No differences encountered
============== _profile5 =============
No differences encountered
============== _profile6 =============
No differences encountered
============== _profile7 =============
No differences encountered
============== _profile8 =============
No differences encountered
============== _profile9 =============
No differences encountered
============== _prt1eval =============
No differences encountered
============== _prtoeval =============
No differences encountered
============== _pty1 =============
No differences encountered
============== _pty2 =============
No differences encountered
============== _rand =============
No differences encountered
============== _randtest =============
No differences encountered
============== _range1 =============
No differences encountered
============== _range2 =============
No differences encountered
============== _re_test =============
No differences encountered
============== _readall =============
No differences encountered
============== _readbuf =============
No differences encountered
============== _readfile2 =============
No differences encountered
============== _rebrackloc =============
No differences encountered
============== _rebt8b1 =============
No differences encountered
============== _rebuf =============
No differences encountered
============== _rebuild =============
No differences encountered
============== _redfilnm =============
No differences encountered
============== _regeq =============
No differences encountered
============== _regex3minus =============
No differences encountered
============== _regexpbad =============
No differences encountered
============== _regexpbrack =============
No differences encountered
============== _regexpbrack2 =============
No differences encountered
============== _regexpbrack3 =============
No differences encountered
============== _regexprange =============
No differences encountered
============== _regexpuparrow =============
No differences encountered
============== _regexsub =============
No differences encountered
============== _reginttrad =============
No differences encountered
============== _regnul1 =============
No differences encountered
============== _regnul2 =============
No differences encountered
============== _regrange =============
No differences encountered
============== _regx8bit =============
No differences encountered
============== _reindops =============
No differences encountered
============== _reint =============
No differences encountered
============== _reint2 =============
No differences encountered
============== _reparse =============
No differences encountered
============== _resplit =============
No differences encountered
============== _revout =============
No differences encountered
============== _revtwoway =============
No differences encountered
============== _rri1 =============
No differences encountered
============== _rs =============
No differences encountered
============== _rscompat =============
No differences encountered
============== _rsgetline =============
No differences encountered
============== _rsglstdin =============
No differences encountered
============== _rsnul1nl =============
No differences encountered
============== _rsnulbig =============
No differences encountered
============== _rsnulbig2 =============
No differences encountered
============== _rsnullre =============
No differences encountered
============== _rsnulw =============
No differences encountered
============== _rsstart1 =============
No differences encountered
============== _rsstart2 =============
No differences encountered
============== _rsstart3 =============
No differences encountered
============== _rstest1 =============
No differences encountered
============== _rstest2 =============
No differences encountered
============== _rstest3 =============
No differences encountered
============== _rstest4 =============
No differences encountered
============== _rstest5 =============
No differences encountered
============== _rstest6 =============
No differences encountered
============== _rswhite =============
No differences encountered
============== _rtlen =============
No differences encountered
============== _rtlen01 =============
No differences encountered
============== _rwarray =============
No differences encountered
============== _sandbox1 =============
No differences encountered
============== _scalar =============
No differences encountered
============== _sclforin =============
No differences encountered
============== _sclifin =============
No differences encountered
============== _setrec0 =============
No differences encountered
============== _setrec1 =============
No differences encountered
============== _shadow =============
No differences encountered
============== _shadowbuiltin =============
No differences encountered
============== _shortest-match =============
No differences encountered
============== _sigpipe1 =============
No differences encountered
============== _sortempty =============
No differences encountered
============== _sortfor =============
No differences encountered
============== _sortfor2 =============
No differences encountered
============== _sortglos =============
No differences encountered
============== _sortu =============
No differences encountered
============== _sourcesplit =============
No differences encountered
============== _space =============
No differences encountered
============== _spacere =============
No differences encountered
============== _split_after_fpat =============
No differences encountered
============== _splitany =============
No differences encountered
============== _splitarg4 =============
No differences encountered
============== _splitargv =============
No differences encountered
============== _splitarr =============
No differences encountered
============== _splitdef =============
No differences encountered
============== _splitvar =============
No differences encountered
============== _splitwht =============
No differences encountered
============== _splitwht2 =============
No differences encountered
============== _status-close =============
No differences encountered
============== _strcat1 =============
No differences encountered
============== _strfieldnum =============
No differences encountered
============== _strftfld =============
No differences encountered
============== _strftime =============
No differences encountered
============== _strftlng =============
No differences encountered
============== _strnum1 =============
No differences encountered
============== _strnum2 =============
No differences encountered
============== _strsubscript =============
No differences encountered
============== _strtod =============
No differences encountered
============== _strtonum =============
No differences encountered
============== _strtonum1 =============
No differences encountered
============== _stupid1 =============
No differences encountered
============== _stupid2 =============
No differences encountered
============== _stupid3 =============
No differences encountered
============== _stupid4 =============
No differences encountered
============== _stupid5 =============
No differences encountered
============== _subamp =============
No differences encountered
============== _subback =============
No differences encountered
============== _subi18n =============
No differences encountered
============== _subsepnm =============
No differences encountered
============== _subslash =============
No differences encountered
============== _substr =============
No differences encountered
============== _swaplns =============
No differences encountered
============== _switch2 =============
No differences encountered
============== _symtab1 =============
No differences encountered
============== _symtab10 =============
No differences encountered
============== _symtab11 =============
No differences encountered
============== _symtab12 =============
No differences encountered
============== _symtab13 =============
No differences encountered
============== _symtab2 =============
No differences encountered
============== _symtab3 =============
No differences encountered
============== _symtab4 =============
No differences encountered
============== _symtab5 =============
No differences encountered
============== _symtab6 =============
No differences encountered
============== _symtab7 =============
No differences encountered
============== _symtab8 =============
No differences encountered
============== _symtab9 =============
No differences encountered
============== _synerr1 =============
No differences encountered
============== _synerr2 =============
No differences encountered
============== _synerr3 =============
No differences encountered
============== _tailrecurse =============
No differences encountered
============== _testext =============
No differences encountered
============== _time =============
No differences encountered
============== _timeout =============
No differences encountered
============== _tradanch =============
No differences encountered
============== _trailbs =============
No differences encountered
============== _tweakfld =============
No differences encountered
============== _typedregex1 =============
No differences encountered
============== _typedregex2 =============
No differences encountered
============== _typedregex3 =============
No differences encountered
============== _typedregex4 =============
No differences encountered
============== _typedregex5 =============
No differences encountered
============== _typedregex6 =============
No differences encountered
============== _typeof1 =============
No differences encountered
============== _typeof2 =============
No differences encountered
============== _typeof3 =============
No differences encountered
============== _typeof4 =============
No differences encountered
============== _typeof5 =============
No differences encountered
============== _typeof6 =============
No differences encountered
============== _typeof7 =============
No differences encountered
============== _typeof8 =============
No differences encountered
============== _typeof9 =============
No differences encountered
============== _unicode1 =============
No differences encountered
============== _uninit2 =============
No differences encountered
============== _uninit3 =============
No differences encountered
============== _uninit4 =============
No differences encountered
============== _uninit5 =============
No differences encountered
============== _uninitialized =============
No differences encountered
============== _unterm =============
No differences encountered
============== _uparrfs =============
No differences encountered
============== _uplus =============
No differences encountered
============== _uplus2 =============
No differences encountered
============== _watchpoint1 =============
No differences encountered
============== _wideidx =============
No differences encountered
============== _wideidx2 =============
No differences encountered
============== _widesub =============
No differences encountered
============== _widesub2 =============
No differences encountered
============== _widesub3 =============
No differences encountered
============== _widesub4 =============
No differences encountered
============== _wjposer1 =============
No differences encountered
============== _zero2 =============
No differences encountered
============== _zeroe0 =============
No differences encountered
============== _zeroflag =============
No differences encountered
gmake[3]: Leaving directory '/export/home/buildbot/slave/gawk-solaris10-i386/build/test'
gmake[2]: Leaving directory '/export/home/buildbot/slave/gawk-solaris10-i386/build/test'
gmake[2]: *** [Makefile:2387: check] Error 1
gmake[1]: *** [Makefile:799: check-recursive] Error 1
gmake[1]: Leaving directory '/export/home/buildbot/slave/gawk-solaris10-i386/build'
gmake: *** [Makefile:1098: check] Error 2